{"text_format":"3","workbook":"xlsx","n_sheets":4,"sheets":["selecteer hier uw barbecue","matrixen","Algemene verkoopsvoorwaarden","Reservatievoorstel"],"not_rendered":{"macros":1,"defined_names":5},"read":"whole","date_system":"1900"}

{"sheet":"selecteer hier uw barbecue","index":0,"n_rows":109,"n_cols":35,"rows_kept":109,"merged":[[12,6,12,10],[13,6,13,10],[14,6,14,10],[15,6,15,10],[16,6,16,10],[17,6,17,10],[18,6,18,10],[19,6,19,10],[20,6,20,10],[21,6,21,10],[22,6,22,10],[32,5,32,7],[35,5,35,7],[36,5,36,7],[37,5,37,7],[38,5,38,7],[39,5,39,7],[41,5,41,10],[42,5,42,7],[43,5,43,7],[87,10,87,17],[89,10,90,24]]}
[null,"Deze info is van: Feestzaal Katelijnenhof, Heirweg 172, 8800 Roeselare. Contacteer de zaakvoerder: 0475/618058 - info@katelijnenhof.be - web: www.katelijnenhof.be met foto's en volledige prijslijst."]
[]
[null,{"$f":"\"Rekenmodule barbecue. \" & matrixen!B1","v":"Rekenmodule barbecue. Prijzen geldig tot 31/03/2023"}]
[]
[{"$nulls":5},"kinderen",null,"kinderen",null,"kinderen"]
[{"$nulls":3},{"$f":"IF(TODAY()>AA11,\"Deze module is niet meer geldig.\",\"\")","v":""},null," 0 t.e.m. 2 j. 11 maand",null,"3 j. t.e.m. 5 j. 11 maand",null,"6 j, t.e.m. 11 jr. 11 maand"]
[null,"Totaal per volwassene:",null,{"$f":"SUM(D10:D982)","v":{"v":40.699999999999996,"d":"40.70"}},null,"0,00",null,{"$f":"ROUND(D7/3,2)","v":13.57},null,{"$f":"ROUND(D7/2,2)","v":20.35}]
[{"$nulls":5},"U kan ook voor de kinderen een kindermenu nemen ( zie een andere rekenmodule)"]
[]
[null,"MAAK STEEDS UW KEUZE in de gele vakken: (scroll naar beneden om meer gegevens in te vullen) Hierboven kunt u uw prijs volgen.",{"$nulls":6},"U vindt verder een overzicht van uw selectie"]
[null,"(klik op de gele balk, vervolgens op het pijltje rechts en scroll ev. naar beneden)",null,"prijs pp",null,"Gedetailleerde info","Selecteer hier uw hapjes:",null,{"$f":"COUNTA(G13:K23)","v":0},"hapjes geselecteerd.",{"$nulls":16},{"$f":"matrixen!B1","v":"Prijzen geldig tot 31/03/2023"}]
[]
[null,"Maak in dit vak uw keuze voor het aperitief",null,{"$f":"VLOOKUP(B13,matrixen!B11:I19,8,FALSE)","v":{"v":0,"d":"0.00"}},null,{"$f":"HLOOKUP($B$13,matrixen!$T$14:$AB$28,2,FALSE)","v":0},{"$nulls":20},{"$f":"matrixen!B11","v":"Maak in dit vak uw keuze voor het aperitief"}]
[null,"Maak in dit vak uw keuze voor het aperitief",{"$nulls":3},{"$f":"HLOOKUP($B$13,matrixen!$T$14:$AB$28,3,FALSE)","v":0},{"$nulls":20},{"$f":"matrixen!B12","v":"1 aperitief per persoon"}]
[null,{"$f":"\"U selecteerde tot nu \" & COUNTA(G13:K23)& \" hapjes.\"","v":"U selecteerde tot nu 0 hapjes."},null,{"$f":"IF(IF(B13=matrixen!N14,('selecteer hier uw barbecue'!I11-4)*matrixen!I47,I11*matrixen!I47)<0,0,IF(B13=matrixen!N14,('selecteer hier uw barbecue'!I11-4)*matrixen!I47,I11*matrixen!I47))","v":{"v":0,"d":"0.00"}},null,{"$f":"HLOOKUP($B$13,matrixen!$T$14:$AB$28,4,FALSE)","v":0},{"$nulls":20},{"$f":"matrixen!B13","v":"2 aperitieven per persoon"}]
[null,{"$f":"IF(B13=matrixen!N14,\"U koos receptie E en daar zijn 4 hapjes inbegrepen. Selecteer er dus zeker 4!\",\"\")","v":""},{"$nulls":3},{"$f":"HLOOKUP($B$13,matrixen!$T$14:$AB$28,5,FALSE)","v":0},{"$nulls":20},{"$f":"matrixen!B14","v":"Receptie E"}]
[{"$nulls":5},{"$f":"HLOOKUP($B$13,matrixen!$T$14:$AB$28,6,FALSE)","v":0},{"$nulls":20},{"$f":"matrixen!B15","v":"Receptie A"}]
[{"$nulls":5},{"$f":"HLOOKUP($B$13,matrixen!$T$14:$AB$28,7,FALSE)","v":0},{"$nulls":20},{"$f":"matrixen!B16","v":0}]
[null,"Indien een genodigde een extra aperitief bestelt of een aperitief wenst die niet in de prijs begrepen is dan:",{"$nulls":3},{"$f":"HLOOKUP($B$13,matrixen!$T$14:$AB$28,8,FALSE)","v":0},{"$nulls":20},{"$f":"matrixen!B17","v":0}]
[null,"De gast die een extra aperitief bestelt betaalt deze zelf",{"$nulls":3},{"$f":"HLOOKUP($B$13,matrixen!$T$14:$AB$28,9,FALSE)","v":0},{"$nulls":20},{"$f":"matrixen!B18","v":0}]
[null,"De gast die een extra aperitief bestelt betaalt deze zelf",{"$nulls":3},{"$f":"HLOOKUP($B$13,matrixen!$T$14:$AB$28,10,FALSE)","v":0},{"$nulls":20},{"$f":"matrixen!B19","v":0}]
[null,"De gast die niet inbegrepen aperitief bestelt betaalt deze zelf (vb: sterke drank)",{"$nulls":3},{"$f":"HLOOKUP($B$13,matrixen!$T$14:$AB$28,11,FALSE)","v":0}]
[null,"Alle extra aperitief komt op de algemene rekening.",{"$nulls":3},{"$f":"HLOOKUP($B$13,matrixen!$T$14:$AB$28,12,FALSE)","v":0},{"$nulls":20},{"$f":"matrixen!B23","v":"Schuimwijn van het huis (reeds inbegrepen)"}]
[null,"Let op: indien slecht weer (vanaf 5 Beaufort of bij hevige neerslag) kunnen wij beslissen om het vlees",{"$nulls":3},{"$f":"HLOOKUP($B$13,matrixen!$T$14:$AB$28,13,FALSE)","v":0},{"$f":"IF(F20=\"tapenades\", matrixen!AM28,\"\")","v":""},{"$nulls":19},{"$f":"matrixen!B24","v":"Cava"}]
[null," te bakken in de keuken binnen. We doen er echter alles aan om de barbecue buiten te laten doorgaan.",{"$nulls":3},{"$f":"HLOOKUP($B$13,matrixen!$T$14:$AB$28,14,FALSE)","v":0},{"$nulls":20},{"$f":"matrixen!B25","v":"Champagne"}]
[{"$nulls":5},{"$f":"HLOOKUP($B$13,matrixen!$T$14:$AB$28,15,FALSE)","v":0},{"$nulls":20},{"$f":"matrixen!B26","v":0}]
[]
[null,"Stel zelf uw barbecue samen!"]
[null,"In de barbecues zijn steeds groenten voorzien,  koude aardappelen en/of aardappel in de pel. Ook de sausjes zijn inbegrepen.",{"$nulls":24},{"$f":"matrixen!B44","v":"Maak hier uw keuze voor extra hapjes bij het aperitief"}]
[null,"Afhankelijk van de soort ingrediënten die u kiest, verandert de prijs van de barbecue. De volwassenen verkrijgen steeds 5 verschillende soorten. De kinderen 3.",{"$nulls":24},{"$f":"matrixen!B45","v":"Nootjes, chips en zoutkoekjes zoveel u wenst,  per pers."}]
{"$rows_left_out":80}
{"sheet":"matrixen","index":1,"n_rows":523,"n_cols":39,"rows_kept":523,"hidden":true}
[null,"Prijzen geldig tot 31/03/2023",{"$nulls":9},"lam, zwanen enz..  . Met foto suppl.",{"$nulls":3},{"v":15,"d":"15.00"}]
["Deze bladen kopiëren en waarden plakken en alle prijzen van de rekenmodules worden aangepast",{"$nulls":10},"Foto op de taart: suppl. € ",null,null,{"v":1,"d":"1.00"},"per stuk taart en € ",null,{"v":12,"d":"12.00"}," per foto"]
[]
[null,"Minimaal verbruik feest",null,null,{"v":1250,"d":"€ 1,250.00"}]
[]
[]
[]
[]
[]
[]
[null,"Maak in dit vak uw keuze voor het aperitief",{"$nulls":10},"Aanpassingen in de omschrijving van de receptie doen IN het kader en alles blijft ok. Allemaal in 1 keer behalve rec & bb borrels",{"$nulls":8},"Omschrijving kan in het kader."]
[null,"1 aperitief per persoon",{"$nulls":6},{"v":6,"d":"€ 6.00"},{"$nulls":3},"Het tabblad recepties en babyb bij aanpassingen niet meenemen wnat daar staan extra rfecepties op.",{"$nulls":8},"Recepties hier worden overal aangepast."]
[null,"2 aperitieven per persoon",{"$nulls":6},{"v":12,"d":"€ 12.00"},{"$nulls":3},"Dat moet dus apart worden aangepast."]
[null,"Receptie E",{"$nulls":6},{"v":12.600000000000001,"d":"€ 12.60"},null,"Maak in dit vak uw keuze voor het aperitief","1 aperitief per persoon","2 aperitieven per persoon","Receptie E","Receptie A",{"$nulls":4},"Maak in dit vak uw keuze voor het aperitief","1 aperitief per persoon","2 aperitieven per persoon",null,"Receptie E",{"$nulls":3},"Receptie A"]
[null,"Receptie A",{"$nulls":6},{"v":10,"d":"€ 10.00"},null,null,"1 per persoon,  ","2 per persoon,  ","Uitgebreide receptie","Basis receptie.",{"$nulls":5},"vrije keuze","vrije keuze",null,"dranken inbegrepen",{"$nulls":3},"dranken inbegrepen",{"$nulls":10},"Keuze aperitiefhapjes:"]
[{"$nulls":11},"eventueel tweede wordt","eventueel derde wordt","met 4 aperitiefglaasjes","Dranken 2 uur inbegrepen.",{"$nulls":5},"Porto rood","Porto rood",null,"gedurende 2 uur",{"$nulls":3},"gedurende 2 uur",{"$nulls":10},"BORD"]
[{"$nulls":11},"direct afgerekend of","direct afgerekend of"," en drank gedurende 2 uur.","Met tapenades:",{"$nulls":5},"Martini","Martini",null,"met huis schuimwijn,",{"$nulls":3},"met huis schuimwijn,",{"$nulls":10},"Bord met rauwe groenten en cocktailsaus (wortel, bloemkool, radijs)"]
[{"$nulls":11},"komt op 1 rekening","komt op 1 rekening",null,"tonijn / pesto spread rosso /zoete peper roomkaas",{"$nulls":5},"Kir","Kir",null,"frisdranken en",{"$nulls":3},"frisdranken en",{"$nulls":10},"Bord met olijven, kaasjes en salamietjes"]
[{"$nulls":20},"Frisdrank","Frisdrank",null,"bieren naar believen.",{"$nulls":3},"bieren naar believen.",{"$nulls":10},"Bord met 3 tapenades (tonijn / pesto spread rosso /zoete peper roomkaas)"]
[{"$nulls":20},"Bieren","Bieren",{"$nulls":16},"KOUD"]
[{"$nulls":20},"nootjes en chips inbegr.","nootjes en chips inbegr.",null,"Assortiment van 4  ",{"$nulls":3},"Ook inbegrepen:",{"$nulls":10},"crunchy sushi"]
[{"$nulls":12},"Roomijs ",{"$nulls":7},"TIP:","TIP:",null,"aperitiefglaasjes",{"$nulls":3},"tapenades",{"$nulls":10},"luzerne met gerookte zalm, eitjes van vliegende vis in wasabi"]
[null,"Schuimwijn van het huis (reeds inbegrepen)",{"$nulls":6},{"v":0,"d":"€ 0.00"},{"$nulls":3},"Bruine chocolademousse",{"$nulls":7},"Receptie A","Receptie A",null,"inbegrepen.",{"$nulls":3},"nootjes en chips",{"$nulls":10},"preischeuten met tijgergarnalen en mini tomaat"]
[null,"Cava",{"$nulls":6},{"v":3.5,"d":"€ 3.50"},{"$nulls":3},"Pasteis de nata",{"$nulls":7},"kost evenveel als","kost evenveel als",null,"Maak uw keuze",{"$nulls":14},"aperoglaasje parmaham met meloenbolletjes"]
[null,"Champagne",{"$nulls":6},{"v":7,"d":"€ 7.00"},{"$nulls":3},"Chocoladebavarois",{"$nulls":7},"2 aperitieven pp.","2 aperitieven pp.",null,"hier rechts! =>",{"$nulls":14},"ganache van foie gras met frambozenconfituur en amandelbrood"]
[{"$nulls":12},"Miserable",{"$nulls":7},"En dan is de drank naar","En dan is de drank naar",{"$nulls":16},"aperoglaasje parmaham met espuma van mango"]
[null,"Schuimwijn brut",{"$nulls":6},{"v":0,"d":"€ 0.00"},{"$nulls":3},"glaasje fruitsla met perensorbet",{"$nulls":7},"believen!","believen!",null,"Liever meer dan 4 hapjes? Geen probleem.",{"$nulls":14},"verse oester"]
[{"$nulls":12},"Witte chocolademousse ",{"$nulls":7},"En met tapenades!","En met tapenades!",null,"Het supplement bedraagt € 1,60 per hapje",{"$nulls":14},"Taboulé met gerookte forel"]
[{"$nulls":12},"Roomsoes met warme chocoladesaus ",{"$nulls":6},"Menu's BBQ",{"$nulls":18},"Haringhapje met curry"]
[null,"Dessertbuffet zonder maaltijd: ",{"$nulls":6},{"v":18,"d":"€ 18.00"},{"$nulls":3},"Tiramisu",{"$nulls":25},"Mini bagel met zalm en kruidenkaas"]
{"$rows_left_out":487}
{"sheet":"Algemene verkoopsvoorwaarden","index":2,"n_rows":38,"n_cols":1,"rows_kept":38}
["Algemene verkoopsvoorwaarden vanaf 01/11/2022:"]
[]
["1) Onze facturen zijn contant te betalen bij levering van de goederen, dit is de dag van het event. Bijgevolg zal in geval van laattijdige betaling van rechtswege en zonder voorafgaande ingebrekestelling een intrest aangerekend worden van 12% per jaar op de bedragen, verschuldigd acht dagen na de vervaldag van de facturen. Tevens zal bij gebrek aan betaling na aanmaning bij gewone brief, het verschuldigde bedrag van rechtswege verhoogd worden met een forfaitaire vergoeding van 12 % met een minimum van € 50  voor bijkomende administratieve kosten, debiteurenbewaking en commerciële stoornissen. Wij behouden ons het recht voor op elk moment de leveringen te staken. Elke klacht over de kwaliteit van de geleverde goederen moet uiterlijk 24 uur na de levering worden overgemaakt. "]
["Klachten in verband met facturatie kunnen slechts in aanmerking worden genomen zo zij binnen de acht dagen na ontvangst van de goederen bij aangetekende brief worden meegedeeld. In geval van betwisting zijn uitsluitend de rechtbanken van Kortrijk bevoegd. De leveringen  geschieden op risico van de bestemmeling. Er wordt uitdrukkelijk overeengekomen dat de klant door het plaatsen van een bestelling onze algemene verkoopsvoorwaarden erkent. Elke wijziging hieraan moet voorafgaandelijk in een schriftelijk akkoord worden vastgelegd."]
[]
["2) Annulatie dient schriftelijk en gedateerd te geschieden. "]
["In geval van annulatie minder dan 60 dagen voor de activiteit blijft het voorschot eigendom van het Katelijnenhof. Voor annulatie minder dan 10 dagen voor de activiteit is de klant in alle gevallen verplicht 35 % van de reservatie waarde van de gehele manifestatie te vergoeden. Bij annulatie minder dan 5 dagen voor  de activiteit is de klant in alle gevallen verplicht de reservatie waarde van de gehele manifestatie te vergoeden."]
[]
["3) Iedere levering van dranken, voedingswaren of diensten in de  zalen is uitsluitend voorbehouden aan het Katelijnenhof, tenzij er een andere schriftelijke overeenkomst is."]
[]
["4) De klant is eraan gehouden voor iedere dansavond met groot orkest een aanvraag tot toelating in te dienen bij SABAM, Rijselsestraat 51, 8500 Kortrijk, Tel : 056/210738 en alle kosten voortvloeiend uit deze aanvraag te dragen.  Voor een gewone disc-jockey betalen wij jaarlijks een vaste bijdrage. Het verbruik (drank en voeding) van de DJ is ten laste van de klant. Gelet op de nieuwe geluidsnormen, van kracht op 01/01/2013, moet de klant de DJ of elke andere persoon of toestel dat  geluid produceert verplichten zich aan deze normen te houden. De toelating voor onze zaal is – maximaal geluidsniveau > 85 dB(A) LAeq,15min en ≤ 95 dB(A) LAeq,15min. Dit is ruim voldoende. Alle boetes ten gevolge een overschrijding van deze voorwaarde zijn ten laste van de klant. Er wordt een professionele houding van elke DJ of geluidstechnicus verwacht."]
["Het is niet toegestaan om muziek af te spelen via B2C diensten zoals Spotify, Deezer, Youtube… Dit geldt voor elke horecazaak, winkel enz… Doet de klant of zijn DJ dat toch en er volgt een boete, dan is deze ten laste van de klant."]
[]
["5) Alle door de klant meegebrachte materiaal dient door de klant te worden verzekerd en direct na het beëindigen van de manifestatie te worden verwijderd uit de zaal. Het Katelijnenhof behoudt het recht de leverancier te aanvaarden en voorschriften te geven om de lokalen ongeschonden te behouden. Het is strikt verboden om versieringen aan de muren of plafonds te bevestigen met duimspijkers of kleefband ! Bij beschadigingen van een deel van de muur wordt het geheel als beschadigd beschouwd."]
[]
["6) Het gebruik van de zaal is strikt beperkt tot de in deze overeenkomst vastgestelde functie. Iedere wijziging in de voorheen verklaarde bestemming brengt automatisch het recht tot prijsherziening met zich mee."]
[]
["7) Het gebruik van de zaal is gratis van zodra het verbruik hoger ligt dan € 1250. Indien het verbruik lager ligt, wordt het factuurbedrag opgetrokken tot € 1250. Indien uw feest cash (max € 3000) of met bancontact betaald wordt op de dag zelf krijgt u een korting van 2 % op de gehele factuur. Voor traiteurdienst gelden andere kortingsregels."]
[]
["8) Sluitingsuren zaal:"]
[]
["In geval van een event dat start ’s morgens start tussen 7u en 10u59 (vb. ontbijt)"]
["Event kan maximaal 6 uur duren."]
[]
["In geval van een event dat start op de middag start tussen 11u en 13u59"]
["De bar sluit om 18u00, de zaal sluit om 18u30."]
[]
["In geval van een event dat start in de namiddag start tussen 14u en 17u59 (vb. babyborrel)"]
["Event kan maximaal 6 uur duren."]
[]
{"$rows_left_out":9}
{"sheet":"Reservatievoorstel","index":3,"n_rows":56,"n_cols":18,"rows_kept":56,"merged":[[2,14,3,14],[2,15,3,15],[2,16,3,16],[2,17,3,17],[9,12,9,13],[12,9,12,11],[12,12,12,16],[14,4,14,8],[14,9,14,17],[16,9,16,17],[23,14,23,17],[25,9,26,17],[32,0,32,8],[34,0,34,2],[36,0,37,7],[40,0,43,8]]}
[null,null,{"$f":"\"Reservatievoorstel. \"&matrixen!B1","v":"Reservatievoorstel. Prijzen geldig tot 31/03/2023"},{"$nulls":7},"Uitsplitsing per BTW tarief.",{"$nulls":4},"Totaalprijs per vol:",{"$f":"E9","v":{"v":40.699999999999996,"d":"40.70"}}]
["Naam Klant:",null,{"$f":"'selecteer hier uw barbecue'!F74","v":0},{"$nulls":3},"Katelijnenhof",{"$nulls":8},{"$f":"IF(Q2>0,\"Prijs drankforfait na de maaltijd  21% BTW:\",\"\")","v":""},{"$f":"'selecteer hier uw barbecue'!D58","v":{"v":0,"d":"0.00"}}]
["Adres:",null,{"$f":"'selecteer hier uw barbecue'!F75","v":0},{"$nulls":3},"Heirweg 172",{"$nulls":5},"Menu",null,"Dep. B",{"$f":"IF(Q2>0,\"Drank- forfait:\",\"\")","v":""},"Totaal aan 21%","Dep. A"]
["Stad:",null,{"$f":"'selecteer hier uw barbecue'!F76","v":0},{"$nulls":3},"8800 Roeselare",{"$nulls":3},"aantal","totaal:","deel 12 %","deel 21%"]
["Tel nr:",null,{"$f":"'selecteer hier uw barbecue'!F77","v":0},{"$nulls":3},"info@katelijnenhof.be",null,null,"Vol",{"$f":"D9","v":10},{"$f":"Q1-Q2","v":{"v":40.699999999999996,"d":"40.70"}},{"$f":"ROUND(L5*0.65,2)","v":26.46},{"$f":"L5-M5","v":{"v":14.239999999999995,"d":"14.24"}},{"$f":"K5*M5","v":{"v":264.6,"d":"264.60"}},{"$f":"Q2","v":{"v":0,"d":"0.00"}},{"$f":"N5+P5","v":{"v":14.239999999999995,"d":"14.24"}},{"$f":"K5*Q5","v":{"v":142.39999999999995,"d":"142.40"}}]
[{"$f":"'selecteer hier uw barbecue'!E79","v":"reden feest:"},null,{"$f":"'selecteer hier uw barbecue'!F79","v":0},{"$nulls":3},"Gsm 0475/618058",null,null,"JR 1/2",{"$f":"D10","v":0},{"$f":"E10-P6","v":20.35},{"$f":"ROUND(L6*0.65,2)","v":13.23},{"$f":"L6-M6","v":{"v":7.120000000000001,"d":"7.12"}},{"$f":"K6*M6","v":{"v":0,"d":"0.00"}},{"$f":"ROUND(Q2/2,2)","v":{"v":0,"d":"0.00"}},{"$f":"N6+P6","v":{"v":7.120000000000001,"d":"7.12"}},{"$f":"K6*Q6","v":{"v":0,"d":"0.00"}}]
["Datum activiteit:",null,{"$f":"'selecteer hier uw barbecue'!F64","v":"00:00:00"},{"$f":"'selecteer hier uw barbecue'!E78","v":"email:"},{"$f":"'selecteer hier uw barbecue'!F78","v":0},null,null,"aankomst om:",{"$f":"'selecteer hier uw barbecue'!F71","v":0},"JR 1/3",{"$f":"D11","v":0},{"$f":"E11-P7","v":13.57},{"$f":"ROUND(L7*0.65,2)","v":8.82},{"$f":"L7-M7","v":4.75},{"$f":"K7*M7","v":{"v":0,"d":"0.00"}},{"$f":"ROUND(Q2/3,2)","v":{"v":0,"d":"0.00"}},{"$f":"N7+P7","v":4.75},{"$f":"K7*Q7","v":{"v":0,"d":"0.00"}}]
["Totaal aantal personen:",null,null,{"$f":"D9+D10+D11+D12","v":10},"prijs:",null,null,"aan tafel om:",{"$f":"'selecteer hier uw barbecue'!F72","v":0},"JR gratis",{"$f":"D12","v":0},{"$f":"E12","v":"0,00"},{"$f":"L8*0.65","v":0},{"$f":"L8*0.35","v":{"v":0,"d":"0.00"}},{"$f":"K8*M8","v":{"v":0,"d":"0.00"}},null,{"$f":"N8+P8","v":0},{"$f":"K8*Q8","v":{"v":0,"d":"0.00"}}]
[null,null,"volwassenen:",{"$f":"'selecteer hier uw barbecue'!F66","v":10},{"$f":"'selecteer hier uw barbecue'!D7","v":{"v":40.699999999999996,"d":"40.70"}},null,null,"raming totaal 1:",{"$f":"D9*E9+D10*E10+D11*E11+D12*E12+D13","v":{"v":406.99999999999994,"d":"€ 407.00"}},null,null,"Voorschot reeds betaald:",{"$nulls":3},{"$f":"IF(Q9>0,\"Huur zaal/exclusiviteit: \",\"\")","v":"Huur zaal/exclusiviteit: "},{"$f":"I11+I12","v":{"v":843,"d":"843.00"}}]
[null,null,"JR 1/2 (6 t.e.m. 11) :",{"$f":"'selecteer hier uw barbecue'!F67","v":0},{"$f":"'selecteer hier uw barbecue'!J7","v":20.35},null,null,"ander rekenblad:",{"$f":"'selecteer hier uw barbecue'!F81","v":{"v":0,"d":"€ 0.00"}},null,null,"Gestort / betaald op:"]
[null,null,"JR 1/3 (3 t.e.m. 5) :",{"$f":"'selecteer hier uw barbecue'!F68","v":0},{"$f":"'selecteer hier uw barbecue'!H7","v":13.57},null,null,"huur zaal:",{"$f":"IF(D9+D10+D11+D12=0,0,IF((I9+I10)<matrixen!E4,matrixen!E4-I9-I10,0))","v":{"v":843,"d":"€ 843.00"}},null,null,{"$f":"IF(M9>0,\"Voorschot uitgesplitst:\",\"\")","v":""},{"$f":"IF(M9>0,\" € \"&M9*0.65 & \" x 12% => Dep. B  en € \" & M9*0.35 & \" x 21% => Dep. A.\",\"\")","v":""}]
[null,null,"JR gratis (0 t.e.m. 2) :",{"$f":"'selecteer hier uw barbecue'!F69","v":0},{"$f":"'selecteer hier uw barbecue'!F7","v":"0,00"},null,null,{"$f":"IF(I12>0,\"U koos exclusiviteit: \",\"\")","v":""},{"$f":"'selecteer hier uw barbecue'!L87","v":{"v":0,"d":"€ 0.00"}},{"$nulls":3},"Voorschot wordt gesplitst over:",{"$f":"IF(M9>0,ROUNDUP((M9+1)/L5,0),0)","v":0}," volwassenen"]
[{"$nulls":7},"raming algemeen totaal:",{"$f":"I9+I10+I11+I12","v":{"v":1250,"d":"€ 1,250.00"}},"Input GKS:",null,null,{"$f":"IF(M9*0.65 >N12*M5,\"ONMOGELIJK U bekomt negatieve waarden.\",\"\")","v":""}]
[{"$nulls":7},"raming te betalen indien contante betaling  (max € 3000 cash):",{"$f":"'selecteer hier uw barbecue'!F86","v":{"v":1225,"d":"€ 1,225.00"}},{"$f":"N12","v":0},"vol","x",{"$f":"IFERROR(M5-M9*0.65/N12,\"\")","v":""},{"v":0.12,"d":"12%"},{"$f":"IFERROR(J14*M14,\"\")","v":""},"Dep. B","Verwerking voorschot"]
[{"$nulls":3},"Voorkeur tafelschikking:",{"$f":"'selecteer hier uw barbecue'!K88","v":"geen voorkeur"},{"$nulls":4},{"$f":"IFERROR( \" Er wordt € \" & ROUND(M9*0.65/N12,2) & \" minder geboekt bij \" & N12 & \" personen omdat dit reeds als voorschot werd geboekt.\",\"\")","v":""}]
[{"$nulls":8},{"$f":"'selecteer hier uw barbecue'!B20","v":"De gast die een extra aperitief bestelt betaalt deze zelf"},{"$f":"N12","v":0},"vol","x",{"$f":"IFERROR(Q5-M9*0.35/N12,\"\")","v":""},{"v":0.21,"d":"21%"},{"$f":"IFERROR(J16*M16,\"\")","v":""},"Dep. A","Verwerking voorschot"]
[{"$f":"'selecteer hier uw barbecue'!H65","v":""},{"$nulls":7},{"$f":"IF(M9>0,\" Uw voorschot van € \" & M9 & \" wordt nog in mindering gebracht\",\"\")","v":""},{"$f":"IFERROR( \" Er wordt € \" & ROUND(M9*0.35/N12,2) & \" minder geboekt bij \" & N12 & \" personen omdat dit reeds als voorschot werd geboekt.\",\"\")","v":""}]
[{"$f":"'selecteer hier uw barbecue'!H66","v":""},{"$nulls":7},{"$f":"'selecteer hier uw barbecue'!G62","v":"Keuze achtergrondmuziek:"},{"$f":"K5-J14","v":10},{"$f":"K14","v":"vol"},"x",{"$f":"M5","v":26.46},{"$f":"N14","v":{"v":0.12,"d":"12%"}},{"$f":"J18*M18","v":{"v":264.6,"d":"264.60"}},"Dep. B"]
[{"$f":"'selecteer hier uw barbecue'!H67","v":0},{"$nulls":7},{"$f":"'selecteer hier uw barbecue'!H62","v":"Geen voorkeur"},{"$f":"K5-J16","v":10},{"$f":"K16","v":"vol"},"x",{"$f":"Q5","v":{"v":14.239999999999995,"d":"14.24"}},{"v":0.21,"d":"21%"},{"v":142.39999999999995,"d":"142.40"},"Dep. A"]
[{"$f":"'selecteer hier uw barbecue'!H71","v":0},{"$nulls":7},{"$f":"VLOOKUP(I19,matrixen!A500:B523,2,FALSE)","v":0},{"$f":"K6","v":0},{"$f":"J6","v":"JR 1/2"},"x",{"$f":"M6","v":13.23},{"$f":"N14","v":{"v":0.12,"d":"12%"}},{"v":0,"d":"0.00"},"Dep. B"]
[null,null,"Barbecue met:",{"$nulls":6},{"$f":"K6","v":0},{"$f":"J6","v":"JR 1/2"},"x",{"$f":"Q6","v":{"v":7.120000000000001,"d":"7.12"}},{"v":0.21,"d":"21%"},{"v":0,"d":"0.00"},"Dep. A"]
[{"$f":"'selecteer hier uw barbecue'!H69","v":"Aardappel in de pel"},{"$nulls":8},{"$f":"K7","v":0},{"$f":"J7","v":"JR 1/3"},"x",{"$f":"M7","v":8.82},{"$f":"N14","v":{"v":0.12,"d":"12%"}},{"v":0,"d":"0.00"},"Dep. B"]
[{"$f":"'selecteer hier uw barbecue'!H70","v":"groenten en sausen"},null,null,{"$f":"IF('selecteer hier uw barbecue'!F33='selecteer hier uw barbecue'!AA40,\"Als voorgerecht een halve kreeft met kruidenboter\",\"\")","v":""},{"$nulls":5},{"$f":"K7","v":0},{"$f":"J7","v":"JR 1/3"},"x",{"$f":"Q7","v":4.75},{"v":0.21,"d":"21%"},{"v":0,"d":"0.00"},"Dep. A"]
[{"$nulls":9},{"$f":"IF(L24>0,\"1\",0)","v":"1"},{"$f":"IF(L24>0,\"x\",\"\")","v":"x"},{"$f":"Q9","v":{"v":843,"d":"843.00"}},{"$f":"IF(L24>0,\"21%\",\"\")","v":"21%"},{"$f":"IF(L24>0,\"Dep. A\",\"\")","v":"Dep. A"},{"$f":"P9","v":"Huur zaal/exclusiviteit: "}]
[{"$f":"'selecteer hier uw barbecue'!J74","v":""},{"$nulls":7},{"$f":"'selecteer hier uw barbecue'!H74","v":""},null,"Totale boekwaarde:",{"$f":"SUM(O14:O23)+L24+M9+I10","v":{"v":1250,"d":"1250.00"}},{"$f":"IF(SUM(O14:O23)+L24+M9+I10 <>I13,\" Er is iets fout met de splitsingstabel\",\"\")","v":""}]
[{"$f":"'selecteer hier uw barbecue'!J75","v":""},{"$nulls":7},{"$f":"'selecteer hier uw barbecue'!H75","v":""},{"$f":"\"De eventuele korting contant van 2 %, in het huidig voorstel is dit € \" & ROUND(I13-I14,2) & \" is nog niet in bovenstaande splitsing verwerkt.\"","v":"De eventuele korting contant van 2 %, in het huidig voorstel is dit € 25 is nog niet in bovenstaande splitsing verwerkt."}]
[{"$f":"'selecteer hier uw barbecue'!J76","v":""},{"$nulls":7},{"$f":"'selecteer hier uw barbecue'!H76","v":""}]
[{"$f":"'selecteer hier uw barbecue'!J77","v":""},{"$nulls":7},{"$f":"'selecteer hier uw barbecue'!H77","v":""},{"$f":"IF(J29<>\"\",\"Detail van het aperitief:\",\"\")","v":""},{"$nulls":5},{"$f":"'selecteer hier uw barbecue'!F18","v":0}]
[{"$f":"'selecteer hier uw barbecue'!J78","v":""},{"$nulls":7},{"$f":"'selecteer hier uw barbecue'!H78","v":""},{"$f":"A17","v":""},null,null,{"$f":"'selecteer hier uw barbecue'!F15","v":0},null,null,{"$f":"'selecteer hier uw barbecue'!F19","v":0}]
[{"$nulls":9},{"$f":"'selecteer hier uw barbecue'!F13","v":0},null,null,{"$f":"'selecteer hier uw barbecue'!F16","v":0},null,null,{"$f":"'selecteer hier uw barbecue'!F20","v":0}]
{"$rows_left_out":26}