{"text_format":"1","workbook":"xlsx","n_sheets":4,"sheets":["selecteer hier uw barbecue","matrixen","Algemene verkoopsvoorwaarden","Reservatievoorstel"],"not_rendered":{"charts":0,"images":0,"macros":1,"external_links":0,"defined_names":3,"comments":0,"pivot_tables":0},"unopened":[],"bounds":{"document_bytes":16777216,"sheet_cells":100000,"rows_first":2000,"rows_last":500,"rows_between":2000,"halvings":0,"cell_chars":16384,"cell_head_chars":4096},"cells_cut":0,"cells_raw":0,"read":"whole","date_system":"1900"}

{"sheet":"selecteer hier uw barbecue","index":0,"n_rows":109,"n_cols":32,"rows_kept":109,"cut":false,"hidden":false,"merged":[[89,10,90,24],[87,10,87,17],[35,5,35,7],[36,5,36,7],[37,5,37,7],[38,5,38,7],[39,5,39,7],[42,5,42,7],[43,5,43,7],[41,5,41,9]]}
[null,"Deze info is van: Feestzaal Katelijnenhof, Heirweg 172, 8800 Roeselare. Contacteer de zaakvoerder: 0475/618058 - info@katelijnenhof.be - web: www.katelijnenhof.be met foto's en volledige prijslijst."]
[]
[null,{"$f":"\"Rekenmodule barbecue. De prijzen van de recepties in deze module gelden voor alle personen waarvan de receptie gevolgd wordt door een maaltijd. Geldig tot \" & DAY(matrixen!B1) & \" - \" & MONTH(matrixen!B1) & \" - \" & YEAR(matrixen!B1)","v":"Rekenmodule barbecue. De prijzen van de recepties in deze module gelden voor alle personen waarvan de receptie gevolgd wordt door een maaltijd. Geldig tot 23 - 2 - 2018"}]
[]
[null,null,null,null,null,"kinderen",null,"kinderen",null,"kinderen"]
[null,null,null,{"$f":"IF(TODAY()>AA11,\"Deze module is niet meer geldig.\",\"\")","v":""},null," 0 t.e.m. 2 j. 11 maand",null,"3 j. t.e.m. 5 j. 11 maand",null,"6 j, t.e.m. 11 jr. 11 maand"]
[null,"Totaal per volwassene:",null,{"$f":"IF(TODAY()>AA11,1/0,SUM(D10:D982))","v":30.8},null,"0,00",null,{"$f":"D7/3","v":10.266666666666667},null,{"$f":"D7/2","v":15.4}]
[null,null,null,null,null,"U kan ook voor de kinderen een kindermenu nemen ( zie een andere rekenmodule)"]
[]
[null,"MAAK STEEDS UW KEUZE in de gele vakken: (scroll naar beneden om meer gegevens in te vullen) Hierboven kunt u uw prijs volgen.",null,null,null,null,null,null,"U vindt verder een overzicht van uw selectie"]
[null,"(klik op de gele balk, vervolgens op het pijltje rechts en scroll ev. naar beneden)",null,"prijs pp",null,"Beknopte info",null,"Gedetailleerde info",null,null,null,null,null,null,null,null,null,null,null,null,null,null,null,null,null,null,{"$f":"matrixen!B1","v":43154}]
[]
[null,"Maak in dit vak uw keuze voor het aperitief",null,{"$f":"VLOOKUP(B13,matrixen!B11:I19,8,FALSE)","v":0},null,{"$f":"HLOOKUP($B$13,matrixen!$K$14:$S$18,2,FALSE)","v":0},null,{"$f":"HLOOKUP($B$13,matrixen!$T$14:$AB$28,2,FALSE)","v":0},null,null,null,null,null,null,null,null,null,null,null,null,null,null,null,null,null,null,{"$f":"matrixen!B11","v":"Maak in dit vak uw keuze voor het aperitief"}]
[null,"Maak in dit vak uw keuze voor het aperitief",null,null,null,{"$f":"HLOOKUP($B$13,matrixen!$K$14:$S$18,3,FALSE)","v":0},null,{"$f":"HLOOKUP($B$13,matrixen!$T$14:$AB$28,3,FALSE)","v":0},null,null,null,null,null,null,null,null,null,null,null,null,null,null,null,null,null,null,{"$f":"matrixen!B12","v":"1 aperitief per persoon"}]
[null,null,null,null,null,{"$f":"HLOOKUP($B$13,matrixen!$K$14:$S$18,4,FALSE)","v":0},null,{"$f":"HLOOKUP($B$13,matrixen!$T$14:$AB$28,4,FALSE)","v":0},null,null,null,null,null,null,null,null,null,null,null,null,null,null,null,null,null,null,{"$f":"matrixen!B13","v":"2 aperitieven per persoon"}]
[null,"Indien een genodigde een extra aperitief bestelt of een aperitief wenst die niet in de prijs begrepen is dan:",null,null,null,{"$f":"HLOOKUP($B$13,matrixen!$K$14:$S$19,5,FALSE)","v":0},null,{"$f":"HLOOKUP($B$13,matrixen!$T$14:$AB$28,5,FALSE)","v":0},null,null,null,null,null,null,null,null,null,null,null,null,null,null,null,null,null,null,{"$f":"matrixen!B14","v":"Receptie F"}]
[null,"De gast die een extra aperitief bestelt betaalt deze zelf",null,null,null,"De gast die een extra aperitief bestelt betaalt deze zelf",null,{"$f":"HLOOKUP($B$13,matrixen!$T$14:$AB$28,6,FALSE)","v":0},null,null,null,null,null,null,null,null,null,null,null,null,null,null,null,null,null,null,{"$f":"matrixen!B15","v":"Receptie E"}]
[null,"De gast die een extra aperitief bestelt betaalt deze zelf",null,null,null,"Alle extra aperitief komt op de algemene rekening.",null,{"$f":"HLOOKUP($B$13,matrixen!$T$14:$AB$28,7,FALSE)","v":0},null,null,null,null,null,null,null,null,null,null,null,null,null,null,null,null,null,null,{"$f":"matrixen!B16","v":"Receptie D"}]
[null,null,null,null,null,null,null,{"$f":"HLOOKUP($B$13,matrixen!$T$14:$AB$28,8,FALSE)","v":0},null,null,null,null,null,null,null,null,null,null,null,null,null,null,null,null,null,null,{"$f":"matrixen!B17","v":"Receptie C"}]
[null,null,null,null,null,null,null,{"$f":"HLOOKUP($B$13,matrixen!$T$14:$AB$28,9,FALSE)","v":0},null,null,null,null,null,null,null,null,null,null,null,null,null,null,null,null,null,null,{"$f":"matrixen!B18","v":"Receptie B"}]
[null,null,null,null,null,null,null,{"$f":"HLOOKUP($B$13,matrixen!$T$14:$AB$28,10,FALSE)","v":0},null,null,null,null,null,null,null,null,null,null,null,null,null,null,null,null,null,null,{"$f":"matrixen!B19","v":"Receptie A"}]
[null,null,null,null,null,null,null,{"$f":"HLOOKUP($B$13,matrixen!$T$14:$AB$28,11,FALSE)","v":0}]
[null,"Let op: indien slecht weer (vanaf 5 Beaufort of bij hevige neerslag) kunnen wij beslissen om het vlees",null,null,null,null,null,{"$f":"HLOOKUP($B$13,matrixen!$T$14:$AB$28,12,FALSE)","v":0},null,null,null,null,null,null,null,null,null,null,null,null,null,null,null,null,null,null,{"$f":"matrixen!B23","v":"Schuimwijn van het huis (reeds inbegrepen)"}]
[null," te bakken in de keuken binnen. We doen er echter alles aan om de barbecue buiten te laten doorgaan.",null,null,null,null,null,{"$f":"HLOOKUP($B$13,matrixen!$T$14:$AB$28,13,FALSE)","v":0},null,null,null,null,null,null,null,null,null,null,null,null,null,null,null,null,null,null,{"$f":"matrixen!B24","v":"Cava"}]
[null,null,null,null,null,null,null,{"$f":"HLOOKUP($B$13,matrixen!$T$14:$AB$28,14,FALSE)","v":0},null,null,null,null,null,null,null,null,null,null,null,null,null,null,null,null,null,null,{"$f":"matrixen!B25","v":"Champagne"}]
[null,null,null,null,null,null,null,{"$f":"HLOOKUP($B$13,matrixen!$T$14:$AB$28,15,FALSE)","v":0},null,null,null,null,null,null,null,null,null,null,null,null,null,null,null,null,null,null,{"$f":"matrixen!B26","v":0}]
[]
[null,"Stel zelf uw barbecue samen!"]
[null,"In de barbecues zijn steeds groenten voorzien,  koude aardappelen en/of aardappel in de pel. Ook de sausjes zijn inbegrepen.",null,null,null,null,null,null,null,null,null,null,null,null,null,null,null,null,null,null,null,null,null,null,null,null,{"$f":"matrixen!B44","v":"Maak hier uw keuze voor extra hapjes bij het aperitief"}]
[null,"Afhankelijk van de soort ingrediënten die u kiest, verandert de prijs van de barbecue. De volwassenen verkrijgen steeds 5 verschillende soorten. De kinderen 3.",null,null,null,null,null,null,null,null,null,null,null,null,null,null,null,null,null,null,null,null,null,null,null,null,{"$f":"matrixen!B45","v":"Nootjes, chips en zoutkoekjes zoveel u wenst,  per pers."}]
{"$rows_left_out":80}
{"sheet":"matrixen","index":1,"n_rows":491,"n_cols":28,"rows_kept":491,"cut":false,"hidden":true,"merged":[]}
[null,"2018-02-23",null,null,null,null,null,null,null,null,null,"lam, zwanen enz..  . Met foto suppl.",null,null,null,15]
["Deze bladen kopiëren en waarden plakken en alle prijzen van de rekenmodules worden aangepast",null,null,null,null,null,null,null,null,null,null,"Foto op de taart: suppl. € ",null,null,0.7,"per stuk taart en € ",null,10," per foto"]
[]
[null,"Minimaal verbruik feest",null,null,950]
[]
[]
[]
[]
[]
[]
[null,"Maak in dit vak uw keuze voor het aperitief",null,null,null,null,null,null,null,null,null,null,"Aanpassingen in de omschrijving van de receptie doen IN het kader en alles blijft ok. Allemaal in 1 keer behalve rec & bb borrels",null,null,null,null,null,null,null,null,"Omschrijving kan in het kader."]
[null,"1 aperitief per persoon",null,null,null,null,null,null,6,null,null,null,"Het tabblad recepties en babyb bij aanpassingen niet meenemen wnat daar staan extra rfecepties op.",null,null,null,null,null,null,null,null,"Recepties hier worden overal aangepast."]
[null,"2 aperitieven per persoon",null,null,null,null,null,null,10,null,null,null,"Dat moet dus apart worden aangepast."]
[null,"Receptie F",null,null,null,null,null,null,15.5,null,"Maak in dit vak uw keuze voor het aperitief","1 aperitief per persoon","2 aperitieven per persoon","Receptie F","Receptie E","Receptie D","Receptie C","Receptie B","Receptie A","Maak in dit vak uw keuze voor het aperitief","1 aperitief per persoon","2 aperitieven per persoon","Receptie F","Receptie E","Receptie D","Receptie C","Receptie B","Receptie A"]
[null,"Receptie E",null,null,null,null,null,null,12.600000000000001,null,null,"1 per persoon,  ","2 per persoon,  ","Zeer uitgebreide receptie","Uitgebreide receptie","Basis receptie.","Zeer uitgebreide receptie","Uitgebreide receptie","Basis receptie.",null,"vrije keuze","vrije keuze","dranken inbegrepen gedurende 2 uur","dranken inbegrepen gedurende 2 uur","dranken inbegrepen gedurende 2 uur","dranken inbegrepen gedurende 2 uur","dranken inbegrepen gedurende 2 uur","dranken inbegrepen gedurende 2 uur"]
[null,"Receptie D",null,null,null,null,null,null,11.100000000000001,null,null,"eventueel tweede wordt","eventueel derde wordt","met 4 aperitiefglaasjes,","met 4 aperitiefglaasjes","Dranken 2 uur inbegrepen.","met 3 koude toastjes en 3 warme ","met 3 koude toastjes en 3 warme ","Dranken 2 uur inbegrepen.",null,"Porto rood","Porto rood","met Schuimwijn van het huis en alle frisdranken en bieren naar believen, ","met Schuimwijn van het huis en alle frisdranken en bieren naar believen, ","met Schuimwijn van het huis en alle frisdranken en bieren naar believen, ","met Schuimwijn van het huis en alle frisdranken en bieren naar believen, ","met Schuimwijn van het huis en alle frisdranken en bieren naar believen, ","met Schuimwijn van het huis en alle frisdranken en bieren naar believen, "]
[null,"Receptie C",null,null,null,null,null,null,15.5,null,null,"direct afgerekend of","direct afgerekend of","een soepje, 2 warme hapjes"," en drank gedurende 2 uur.",null,"hapjes, kleine versnaperingen","hapjes, kleine versnaperingen",null,null,"Martini","Martini","Assortiment van 4 aperitiefglaasjes (samenstelling kan verschillen), een soepje en 2 warme hapjes","Assortiment van 4 aperitiefglaasjes: (samenstelling kan verschillen)","kaasjes, salami, tapenades,","kaasjes, salami,  olijven, nootjes en chips.","kaasjes, salami,  olijven, nootjes en chips.","tapenades"]
[null,"Receptie B",null,null,null,null,null,null,12.600000000000001,null,null,"komt op 1 rekening","komt op 1 rekening","en drank gedurende 2 uur.",null,null,"en drank gedurende 2 uur.",null,null,null,"Kir","Kir","* eendenmousse met rode bessen en koornbloemblaadjes","* eendenmousse met rode bessen en koornbloemblaadjes"," olijven en nootjes en chips","lepeltje gevuld met vismousse","lepeltje gevuld met vismousse","nootjes en chips"]
[null,"Receptie A",null,null,null,null,null,null,10,null,null,null,null,null,null,null,null,null,null,null,"Frisdrank","Frisdrank","* luzerne met gerookte zalm, eitjes van vliegende vis in wasabi","* luzerne met gerookte zalm, eitjes van vliegende vis in wasabi",null,"lepeltje gevuld met vleesmousse","lepeltje gevuld met vleesmousse"]
[null,null,null,null,null,null,null,null,null,null,null,null,null,null,null,null,null,null,null,null,"Bieren","Bieren","* mousse van krab met rode bietscheutjes","* mousse van krab met rode bietscheutjes",null,"3 warme hapjes pp","3 warme hapjes pp"]
[null,null,null,null,null,null,null,null,null,null,null,null,null,null,null,null,null,null,null,null,"nootjes en chips inbegrepen","nootjes en chips inbegrepen","* preischeuten met garnalen en mini tomaat","* preischeuten met garnalen en mini tomaat",null,"* kippenbilletje * toastcupje * garnaal in filodeeg","* kippenbilletje * toastcupje * garnaal in filodeeg"]
[null,null,null,null,null,null,null,null,null,null,null,null,null,null,null,null,null,null,null,null,"TIP:","TIP:","* tomatensoepje en 2 warme hapjes, standaard een garnaal in filodeeg en een kippenvleugeltje",null,null,"3 koude toostjes pp"]
[null,"Schuimwijn van het huis (reeds inbegrepen)",null,null,null,null,null,null,0,null,null,null,null,null,null,null,null,null,null,null,"Een receptie naar believen","Receptie A is dezelfde prijs.","TIP: Er is veel meer keuze dan de standaard hapjes","TIP: Er is veel meer keuze dan de standaard hapjes",null,"* gerookte zalm * vissalade * grijze garnalen"]
[null,"Cava",null,null,null,null,null,null,3.25,null,null,null,null,null,null,null,null,null,null,null,"kost evenveel als","Maar daar is de drank naar believen gedurende ","die hierboven vermeld worden. Via deze tool kunt u dit","die hierboven vermeld worden. Via deze tool kunt u dit",null,"Tip: Bovenstaande hapjes kunnen ook gewijzigd worden.","Tip: Bovenstaande hapjes kunnen ook gewijzigd worden."]
[null,"Champagne",null,null,null,null,null,null,7,null,null,null,null,null,null,null,null,null,null,null,"2 aperitieven per persoon.","maximaal 2 uur. En er zijn wat tapenades.","niet aanpassen maar wel als u bij ons langskomt. ","niet aanpassen maar wel als u bij ons langskomt. ",null,"Niet via deze tool maar wel bij reservatie","Niet via deze tool maar wel bij reservatie"]
[null,null,null,null,null,null,null,null,null,null,null,null,null,null,null,null,null,null,null,null,"Selecteer daartoe receptie A!","We komen rond met schuimwijn en ","De keuzemogelijkheden staan gedetailleerd ","De keuzemogelijkheden staan gedetailleerd ",null,"De keuzemogelijkheden staan gedetailleerd ","De keuzemogelijkheden staan gedetailleerd "]
[null,"Schuimwijn brut",null,null,null,null,null,null,0,null,null,null,null,null,null,null,null,null,null,null,null,"fruitsap maar alle bovenstaande dranken","beschreven in het pdf document \"prijslijst\" pagina 9.","beschreven in het pdf document \"prijslijst\" pagina 9.",null,"beschreven in het pdf document \"prijslijst\" pagina 9.","beschreven in het pdf document \"prijslijst\" pagina 9."]
[null,null,null,null,null,null,null,null,null,null,null,null,null,null,null,null,null,null,null,null,null,"kunnen op vraag ook bekomen worden.","U krijgt hier wel een prijsindicatie maar weet dat er meer moglijkheden zijn.","U krijgt hier wel een prijsindicatie maar weet dat er meer moglijkheden zijn.",null,"U krijgt hier wel een prijsindicatie maar weet dat er meer moglijkheden zijn.","U krijgt hier wel een prijsindicatie maar weet dat er meer moglijkheden zijn."]
[null,null,null,null,null,null,null,null,null,null,null,null,null,null,null,null,null,null,null,"Menu's BBQ"]
[null,"Dessertbuffet zonder maaltijd: ",null,null,null,null,null,null,16.5]
{"$rows_left_out":462}
{"sheet":"Algemene verkoopsvoorwaarden","index":2,"n_rows":63,"n_cols":12,"rows_kept":63,"cut":false,"hidden":false,"merged":[]}
[null,"Algemene verkoopsvoorwaarden:"]
[null,"1) Onze facturen zijn contant te betalen bij levering van de goederen. Bijgevolg zal in geval van laattijdige betaling"]
[null,"van rechtswege en zonder voorafgaande ingebrekestelling een intrest aangerekend worden van 12% per jaar op de "]
[null,"bedragen, verschuldigd acht dagen na de vervaldag van de facturen. Tevens zal bij gebrek aan betaling na "]
[null,"aanmaning bij gewone brief, het verschuldigde bedrag van rechtswege verhoogd worden met een forfaitaire"]
[null,"vergoeding van 12 % met een minimum van € 50  voor bijkomende administratieve kosten, debiteurenbewaking "]
[null,"en commerciële stoornissen. Wij behouden ons het recht voor op elk moment de leveringen te staken. Elke "]
[null,"klacht over de kwaliteit van de geleverde goederen moet uiterlijk 24 uur na de levering worden overgemaakt. "]
[null,"Klachten in verband met facturatie kunnen slechts in aanmerking worden genomen zo zij binnen de acht "]
[null,"dagen na ontvangst van de goederen bij aangetekende brief worden meegedeeld. In geval van betwisting zijn "]
[null,"uitsluitend de rechtbanken van Kortrijk bevoegd. De leveringen  geschieden op risico van de bestemmeling. Er "]
[null,"wordt uitdrukkelijk overeengekomen dat de klant door het plaatsen van een bestelling onze algemene "]
[null,"verkoopsvoorwaarden erkent. Elke wijziging hieraan moet voorafgaandelijk in een schriftelijk akkoord worden "]
[null,"vastgelegd."]
[]
[null,"2) Annulatie dient schriftelijk en gedateerd te geschieden. "]
[null,"In geval van annulatie minder dan 60 dagen voor de activiteit blijft het voorschot eigendom van het Katelijnenhof."]
[null,"Voor annulatie minder dan 10 dagen voor de activiteit is de klant in alle gevallen verplicht 35 % van de reservatie-"]
[null,"waarde van de gehele manifestatie te vergoeden."]
[null,"Bij annulatie minder dan 5 dagen voor  de activiteit is de klant in alle gevallen verplicht de reservatie waarde van de "]
[null,"gehele manifestatie te vergoeden."]
[]
[null,"3) Iedere levering van dranken, voedingswaren of diensten in de  zalen is uitsluitend voorbehouden aan het "]
[null,"Katelijnenhof, tenzij er een andere schriftelijke overeenkomst is."]
[]
[null,"4) De klant is eraan gehouden voor iedere dansavond met groot orkest een aanvraag tot toelating in te dienen bij "]
[null,"SABAM, Rijselsestraat 51, 8500 Kortrijk, Tel : 056/210738 en alle kosten voortvloeiend uit deze aanvraag te "]
[null,"dragen.  Voor een gewone disc-jockey betalen wij jaarlijks een vaste bijdrage. Het verbruik (drank en voeding) "]
[null,"van de DJ is ten laste van de klant. Gelet op de nieuwe geluidsnormen, van kracht op 01/01/2013, moet de "]
[null,"klant de DJ of elke andere persoon of toestel dat  geluid produceert verplichten zich aan deze normen te houden. "]
{"$rows_left_out":34}
{"sheet":"Reservatievoorstel","index":3,"n_rows":50,"n_cols":18,"rows_kept":50,"cut":false,"hidden":false,"merged":[[2,16,3,16],[40,0,43,8],[2,14,3,14],[2,15,3,15],[2,17,3,17],[9,12,9,13],[14,9,14,17],[16,9,16,17],[12,12,12,16],[23,14,23,17],[12,9,12,11],[25,9,26,17],[36,0,37,7]]}
[null,null,"Reservatievoorstel",null,null,null,null,null,null,null,"Uitsplitsing per BTW tarief.",null,null,null,null,"Totaalprijs per vol:",{"$f":"E9","v":30.8}]
["Naam Klant:",null,{"$f":"'selecteer hier uw barbecue'!F74","v":0},null,null,null,"Katelijnenhof",null,null,null,null,null,null,null,null,{"$f":"IF(Q2>0,\"Prijs drankforfait na de maaltijd, volledig aan 21% BTW:\",\"\")","v":""},{"$f":"'selecteer hier uw barbecue'!D58","v":0}]
["Adres:",null,{"$f":"'selecteer hier uw barbecue'!F75","v":0},null,null,null,"Heirweg 172",null,null,null,null,null,"Menu",null,"Dep. B",{"$f":"IF(Q2>0,\"Drank- forfait:\",\"\")","v":""},"Totaal aan 21%","Dep. A"]
["Stad:",null,{"$f":"'selecteer hier uw barbecue'!F76","v":0},null,null,null,"8800 Roeselare",null,null,null,"aantal","totaal:","deel 12%","deel21%"]
["Tel nr:",null,{"$f":"'selecteer hier uw barbecue'!F77","v":0},null,null,null,"info@katelijnenhof.be",null,null,"Vol",{"$f":"D9","v":0},{"$f":"Q1-Q2","v":30.8},{"$f":"ROUND(L5*0.65,2)","v":20.02},{"$f":"L5-M5","v":10.780000000000001},{"$f":"K5*M5","v":0},{"$f":"Q2","v":0},{"$f":"N5+P5","v":10.780000000000001},{"$f":"K5*Q5","v":0}]
[{"$f":"'selecteer hier uw barbecue'!E78","v":"reden feest:"},null,{"$f":"'selecteer hier uw barbecue'!F78","v":0},null,null,null,"Gsm 0475/618058",null,null,"JR 1/2",{"$f":"D10","v":0},{"$f":"L5/2","v":15.4},{"$f":"ROUND(L6*0.65,2)","v":10.01},{"$f":"L6-M6","v":5.3900000000000006},{"$f":"K6*M6","v":0},{"$f":"Q2/2","v":0},{"$f":"N6+P6","v":5.3900000000000006},{"$f":"K6*Q6","v":0}]
["Datum activiteit:",null,{"$f":"'selecteer hier uw barbecue'!F64","v":"00:00:00"},null,null,null,null,null,null,"JR 1/3",{"$f":"D11","v":0},{"$f":"L5/3","v":10.266666666666667},{"$f":"ROUND(L7*0.65,2)","v":6.67},3.5966666666666676,0,{"$f":"Q2/3","v":0},{"$f":"N7+P7","v":3.5966666666666676},0]
["Totaal aantal personen:",null,null,{"$f":"D9+D10+D11+D12","v":0},"prijs:",null,null,"aankomst om:",{"$f":"'selecteer hier uw barbecue'!F71","v":0},"JR gratis",{"$f":"D12","v":0},{"$f":"E12","v":"0,00"},{"$f":"L8*0.65","v":0},{"$f":"L8*0.35","v":0},0,null,{"$f":"N8+P8","v":0},0]
[null,null,"volwassenen:",{"$f":"'selecteer hier uw barbecue'!F66","v":0},{"$f":"'selecteer hier uw barbecue'!D7","v":30.8},null,null,"aan tafel om:",{"$f":"'selecteer hier uw barbecue'!F72","v":0},null,null,"Voorschot reeds betaald:",null,null,null,{"$f":"IF(Q9>0,\"Huur zaal/muziekinstallatie: \",\"\")","v":""},{"$f":"I12+D13","v":0}]
[null,null,"JR 1/2 (6 t.e.m. 11) :",{"$f":"'selecteer hier uw barbecue'!F67","v":0},{"$f":"'selecteer hier uw barbecue'!J7","v":15.4},null,null,"raming totaal 1:",{"$f":"D9*E9+D10*E10+D11*E11+D12*E12+D13","v":0},null,null,"Gestort / betaald op:"]
[null,null,"JR 1/3 (3 t.e.m. 5) :",{"$f":"'selecteer hier uw barbecue'!F68","v":0},{"$f":"'selecteer hier uw barbecue'!H7","v":10.266666666666667},null,null,"ander rekenblad:",{"$f":"'selecteer hier uw barbecue'!F81","v":0},null,null,{"$f":"IF(M9>0,\"Voorschot uitgesplitst:\",\"\")","v":""},{"$f":"IF(M9>0,\" € \"&M9*0.65 & \" x 12% => Dep. B  en € \" & M9*0.35 & \" x 21% => Dep. A.\",\"\")","v":""}]
[null,null,"JR gratis (0 t.e.m. 2) :",{"$f":"'selecteer hier uw barbecue'!F69","v":0},{"$f":"'selecteer hier uw barbecue'!F7","v":"0,00"},null,null,"huur zaal:",{"$f":"IF(D9+D10+D11+D12=0,0,IF((I10+I11)<'Algemene verkoopsvoorwaarden'!I44,'Algemene verkoopsvoorwaarden'!I44-I10-I11,0))","v":0},null,null,null,"Voorschot wordt gesplitst over:",{"$f":"IF(M9>0,ROUNDUP((M9+1)/L5,0),0)","v":0}," volwassenen"]
[null,null,null,{"$f":"'selecteer hier uw barbecue'!I61","v":0},null,null,null,"raming algemeen totaal:",{"$f":"I10+I11+I12","v":0},"Input GKS:",null,null,{"$f":"IF(M9*0.65 >N12*M5,\"ONMOGELIJK U bekomt negatieve waarden.\",\"\")","v":""}]
[null,null,null,null,null,null,null,"raming te betalen indien contante betaling  (max € 3000 cash):",{"$f":"'selecteer hier uw barbecue'!F86","v":0},{"$f":"N12","v":0},"vol","x",{"$f":"IFERROR(M5-M9*0.65/N12,\"\")","v":""},0.12,{"$f":"IFERROR(J14*M14,\"\")","v":""},"Dep. B","Verwerking voorschot"]
[null,null,null,"Voorkeur tafelschikking:",null,null,null,null,{"$f":"'selecteer hier uw barbecue'!K88","v":"geen voorkeur"},{"$f":"IFERROR( \" Er wordt € \" & ROUND(M9*0.65/N12,2) & \" minder geboekt bij \" & N12 & \" personen omdat dit reeds als voorschot werd geboekt.\",\"\")","v":""}]
[null,null,null,null,null,null,null,null,{"$f":"'selecteer hier uw barbecue'!B17","v":"De gast die een extra aperitief bestelt betaalt deze zelf"},{"$f":"N12","v":0},"vol","x",{"$f":"IFERROR(Q5-M9*0.35/N12,\"\")","v":""},0.21,{"$f":"IFERROR(J16*M16,\"\")","v":""},"Dep. A","Verwerking voorschot"]
[{"$f":"'selecteer hier uw barbecue'!H65","v":""},null,null,null,null,null,null,null,{"$f":"IF(M9>0,\" Uw voorschot van € \" & M9 & \" wordt nog in mindering gebracht\",\"\")","v":""},{"$f":"IFERROR( \" Er wordt € \" & ROUND(M9*0.35/N12,2) & \" minder geboekt bij \" & N12 & \" personen omdat dit reeds als voorschot werd geboekt.\",\"\")","v":""}]
[{"$f":"'selecteer hier uw barbecue'!H66","v":""},null,null,null,null,null,null,null,null,{"$f":"K5-J14","v":0},{"$f":"K14","v":"vol"},"x",{"$f":"M5","v":20.02},0.12,{"$f":"J18*M18","v":0},"Dep. B"]
[{"$f":"'selecteer hier uw barbecue'!H67","v":""},null,null,null,null,null,null,null,null,{"$f":"K5-J16","v":0},{"$f":"K16","v":"vol"},"x",{"$f":"Q5","v":10.780000000000001},0.21,0,"Dep. A"]
[{"$f":"'selecteer hier uw barbecue'!H68","v":""},null,null,null,null,null,null,null,null,{"$f":"K6","v":0},{"$f":"J6","v":"JR 1/2"},"x",{"$f":"M6","v":10.01},0.12,0,"Dep. B"]
[{"$f":"'selecteer hier uw barbecue'!H69","v":""},null,null,null,null,null,null,null,null,{"$f":"K6","v":0},{"$f":"J6","v":"JR 1/2"},"x",{"$f":"Q6","v":5.3900000000000006},0.21,0,"Dep. A"]
[{"$f":"'selecteer hier uw barbecue'!H70","v":""},null,null,null,null,null,null,null,null,{"$f":"K7","v":0},{"$f":"J7","v":"JR 1/3"},"x",{"$f":"M7","v":6.67},0.12,0,"Dep. B"]
[{"$f":"'selecteer hier uw barbecue'!H71","v":""},null,null,null,null,null,null,null,null,{"$f":"K7","v":0},{"$f":"J7","v":"JR 1/3"},"x",{"$f":"Q7","v":3.5966666666666676},0.21,0,"Dep. A"]
[null,null,"Barbecue met:",null,null,null,null,null,null,{"$f":"IF(L24>0,\"1\",0)","v":0},{"$f":"IF(L24>0,\"x\",\"\")","v":""},{"$f":"Q9","v":0},{"$f":"IF(L24>0,\"21%\",\"\")","v":""},{"$f":"IF(L24>0,\"Dep. A\",\"\")","v":""},{"$f":"P9","v":""}]
[{"$f":"'selecteer hier uw barbecue'!H72","v":"Aardappel in de pel"},null,null,null,null,null,null,null,null,null,"Totale boekwaarde:",{"$f":"SUM(O14:O23)+L24+M9+I11","v":0},{"$f":"IF(SUM(O14:O23)+L24+M9+I11 <>I13,\" Er is iets fout met de splitsingstabel\",\"\")","v":""}]
[{"$f":"'selecteer hier uw barbecue'!H73","v":"groenten en sausen"},null,null,null,null,null,null,null,null,{"$f":"\"De eventuele korting contant van 2 %, in het huidig voorstel is dit € \" & ROUND(I13-I14,2) & \" is nog niet in bovenstaande splitsing verwerkt.\"","v":"De eventuele korting contant van 2 %, in het huidig voorstel is dit € 0 is nog niet in bovenstaande splitsing verwerkt."}]
[{"$f":"'selecteer hier uw barbecue'!H74","v":""},null,null,null,null,null,null,null,{"$f":"'selecteer hier uw barbecue'!J74","v":""}]
[{"$f":"'selecteer hier uw barbecue'!H75","v":""},null,null,null,null,null,null,null,{"$f":"'selecteer hier uw barbecue'!J75","v":""},{"$f":"IF(J29<>\"\",\"Detail van het aperitief:\",\"\")","v":""}]
[{"$f":"'selecteer hier uw barbecue'!H76","v":""},null,null,null,null,null,null,null,{"$f":"'selecteer hier uw barbecue'!J76","v":""},{"$f":"A17","v":""}]
[{"$f":"'selecteer hier uw barbecue'!H77","v":""},null,null,null,null,null,null,null,{"$f":"'selecteer hier uw barbecue'!J77","v":""},{"$f":"'selecteer hier uw barbecue'!H13","v":0}]
{"$rows_left_out":20}