{"text_format":"3","workbook":"xlsx","n_sheets":4,"sheets":["koud buffet","matrixen","Algemene verkoopsvoorwaarden","Reservatievoorstel"],"not_rendered":{"macros":1,"external_links":1,"defined_names":4},"read":"whole","date_system":"1900"}

{"sheet":"koud buffet","index":0,"n_rows":139,"n_cols":38,"rows_kept":139,"merged":[[12,6,12,10],[13,6,13,10],[14,6,14,10],[15,6,15,10],[16,6,16,10],[17,6,17,10],[18,6,18,10],[19,6,19,10],[20,6,20,10],[21,6,21,10],[22,6,22,10],[78,1,79,1],[101,10,101,14],[102,10,102,14],[103,10,103,14]]}
[null,"Deze info is van: Feestzaal Katelijnenhof, Heirweg 172, 8800 Roeselare. Contacteer de zaakvoerder: 0475/618058 - info@katelijnenhof.be - web: www.katelijnenhof.be met foto's en volledige prijslijst."]
[]
[null,{"$f":"\"Rekenmodule koud buffet. De prijzen van de recepties in deze module gelden voor alle personen waarvan de receptie gevolgd wordt door een maaltijd. Geldig  tot \" & DAY(matrixen!B1) & \" - \" & MONTH(matrixen!B1) & \" - \" & YEAR(matrixen!B1)","v":"Rekenmodule koud buffet. De prijzen van de recepties in deze module gelden voor alle personen waarvan de receptie gevolgd wordt door een maaltijd. Geldig  tot 31 - 12 - 2020"}]
[]
[{"$nulls":5},"kinderen",null,"kinderen",null,"kinderen"]
[{"$nulls":3},{"$f":"IF(TODAY()>AA11,\"Deze module is niet meer geldig.\",\"\")","v":""},null," 0 t.e.m. 2 j. 11 maand",null,"3 j. t.e.m. 5 j. 11 maand",null,"6 j, t.e.m. 11 jr. 11 maand"]
[null,"Totaal per volwassene:",null,{"$f":"IF(TODAY()>AA11,1/0,SUM(D10:D1001))","v":{"v":33.8,"d":"33.80"}},null,"0,00",null,{"$f":"ROUND(D7/3,2)","v":11.27},null,{"$f":"ROUND(D7/2,2)","v":{"v":16.9,"d":"16.90"}}]
[{"$nulls":5},"U kan ook voor de kinderen een kindermenu nemen ( zie een andere rekenmodule)"]
[]
[null,"MAAK STEEDS UW KEUZE in de gele vakken: (scroll naar beneden om meer gegevens in te vullen) Hierboven kunt u uw prijs volgen.",{"$nulls":6},"U vindt verder een overzicht van uw selectie"]
[null,"(klik op de gele balk, vervolgens op het pijltje rechts en scroll ev. naar beneden)",null,"prijs pp",null,"Gedetailleerde info","Selecteer hier uw hapjes:",null,{"$f":"COUNTA(G13:K23)","v":0},"hapjes geselecteerd.",{"$nulls":16},{"$f":"matrixen!B1","v":"2020-12-31"}]
[]
[null,"Maak in dit vak uw keuze voor het aperitief",null,{"$f":"VLOOKUP(B13,matrixen!B11:I19,8,FALSE)","v":{"v":0,"d":"0.00"}},null,{"$f":"HLOOKUP($B$13,matrixen!$T$14:$AB$28,2,FALSE)","v":0},{"$nulls":31},{"$f":"matrixen!AM16","v":"KOUD: crunchy sushi"}]
[null,"Maak in dit vak uw keuze voor het aperitief",{"$nulls":3},{"$f":"HLOOKUP($B$13,matrixen!$T$14:$AB$28,3,FALSE)","v":0},{"$nulls":20},{"$f":"matrixen!B11","v":"Maak in dit vak uw keuze voor het aperitief"},{"$nulls":10},{"$f":"matrixen!AM17","v":"luzerne met gerookte zalm, eitjes van vliegende vis in wasabi"}]
[null,{"$f":"\"U selecteerde tot nu \" & COUNTA(G13:K23)+IF(G24<>\"\",1,0)& \" hapjes.\"","v":"U selecteerde tot nu 0 hapjes."},null,{"$f":"IF(IF(B13=matrixen!N14,(I11-4)*matrixen!I46,I11*matrixen!I46)<0,0,IF(B13=matrixen!N14,(I11-4)*matrixen!I46,I11*matrixen!I46))","v":{"v":0,"d":"0.00"}},null,{"$f":"HLOOKUP($B$13,matrixen!$T$14:$AB$28,4,FALSE)","v":0},{"$nulls":20},{"$f":"matrixen!B12","v":"1 aperitief per persoon"},{"$nulls":10},{"$f":"matrixen!AM18","v":"preischeuten met tijgergarnalen en mini tomaat"}]
[{"$nulls":5},{"$f":"HLOOKUP($B$13,matrixen!$T$14:$AB$28,5,FALSE)","v":0},{"$nulls":20},{"$f":"matrixen!B13","v":"2 aperitieven per persoon"},{"$nulls":10},{"$f":"matrixen!AM19","v":"aperoglaasje parmaham met meloenbolletjes"}]
[{"$nulls":5},{"$f":"HLOOKUP($B$13,matrixen!$T$14:$AB$28,6,FALSE)","v":0},{"$nulls":20},{"$f":"matrixen!B14","v":"Receptie E"},{"$nulls":10},{"$f":"matrixen!AM20","v":"ganache van foie gras met frambozenconfituur en amandelbrood"}]
[{"$nulls":5},{"$f":"HLOOKUP($B$13,matrixen!$T$14:$AB$28,7,FALSE)","v":0},{"$nulls":20},{"$f":"matrixen!B15","v":"Receptie A"},{"$nulls":10},{"$f":"matrixen!AM21","v":"aperoglaasje parmaham met espuma van mango"}]
[null,"Indien een genodigde een extra aperitief bestelt of een aperitief wenst die niet in de prijs begrepen is dan:",{"$nulls":3},{"$f":"HLOOKUP($B$13,matrixen!$T$14:$AB$28,8,FALSE)","v":0},{"$nulls":20},{"$f":"matrixen!B16","v":0},{"$nulls":10},{"$f":"matrixen!AM22","v":"verse oester"}]
[null,"De gast die een extra aperitief bestelt betaalt deze zelf",{"$nulls":3},{"$f":"HLOOKUP($B$13,matrixen!$T$14:$AB$28,9,FALSE)","v":0},{"$nulls":20},{"$f":"matrixen!B17","v":0},{"$nulls":10},{"$f":"matrixen!AM23","v":"Taboulé met gerookte forel"}]
[null,"De gast die een extra aperitief bestelt betaalt deze zelf",{"$nulls":3},{"$f":"HLOOKUP($B$13,matrixen!$T$14:$AB$28,10,FALSE)","v":0},{"$nulls":20},{"$f":"matrixen!B18","v":0},{"$nulls":10},{"$f":"matrixen!AM24","v":"Haringhapje met curry"}]
[null,"Het mag op de gemeenschappelijke rekening.",{"$nulls":3},{"$f":"HLOOKUP($B$13,matrixen!$T$14:$AB$28,11,FALSE)","v":0},{"$nulls":20},{"$f":"matrixen!B19","v":0},{"$nulls":10},{"$f":"matrixen!AM25","v":"Mini bagel met zalm en kruidenkaas"}]
[{"$nulls":5},{"$f":"HLOOKUP($B$13,matrixen!$T$14:$AB$28,12,FALSE)","v":0},{"$nulls":20},{"$f":"matrixen!B20","v":0},{"$nulls":10},{"$f":"matrixen!AM26","v":"BORD: op tafel met rauwe groenten en cocktailsaus (wortel, bloemkool, radijs)"}]
[{"$nulls":5},{"$f":"HLOOKUP($B$13,matrixen!$T$14:$AB$28,13,FALSE)","v":0},{"$f":"IF(F20=\"tapenades\", matrixen!AM28 & \" nootjes en chips\",\"\")","v":""},{"$nulls":19},{"$f":"matrixen!#REF!","v":{"$error":"#REF!"}},{"$nulls":10},{"$f":"matrixen!AM27","v":"Bord met olijven, kaasjes en salamietjes"}]
[{"$nulls":5},{"$f":"HLOOKUP($B$13,matrixen!$T$14:$AB$28,14,FALSE)","v":0},{"$nulls":20},{"$f":"matrixen!B22","v":0},{"$nulls":10},{"$f":"matrixen!AM28","v":"Bord met 3 tapenades (tonijn / pesto spread rosso /zoete peper roomkaas)"}]
[{"$nulls":5},{"$f":"HLOOKUP($B$13,matrixen!$T$14:$AB$28,15,FALSE)","v":0},{"$nulls":20},{"$f":"matrixen!B23","v":"Schuimwijn van het huis (reeds inbegrepen)"},{"$nulls":10},{"$f":"matrixen!AM29","v":"WARM: mini hot-dog"}]
[{"$nulls":26},{"$f":"matrixen!B24","v":"Cava"},{"$nulls":10},{"$f":"matrixen!AM30","v":"Breydelspek met mosterdroomsaus"}]
[null,"Stel zelf uw koud buffet samen!",{"$nulls":24},{"$f":"matrixen!B25","v":"Champagne"},{"$nulls":10},{"$f":"matrixen!AM31","v":"aperoglaasje scampi"}]
[null,"In elk buffet zijn steeds groenten voorzien,  koude aardappelen en/of aardappel in de pel en de schotels worden versierd met fruit. Ook de sausjes zijn inbegrepen.",{"$nulls":24},{"$f":"matrixen!B26","v":0},{"$nulls":10},{"$f":"matrixen!AM32","v":"Warme dagvis met curry"}]
[null,"Afhankelijk van de soort ingrediënten die u kiest, verandert de prijs van het buffet. U mag elk ingrediënt meermaals aanduiden als u graag van iets een grotere portie heeft .",{"$nulls":35},{"$f":"matrixen!AM33","v":"een gevuld toastcupje"}]
{"$rows_left_out":110}
{"sheet":"matrixen","index":1,"n_rows":382,"n_cols":39,"rows_kept":382,"hidden":true}
[null,"2020-12-31",{"$nulls":9},"lam, zwanen enz..  . Met foto suppl.",{"$nulls":3},{"v":15,"d":"15.00"}]
[{"$nulls":11},"Foto op de taart: suppl. € ",null,null,{"v":0.7,"d":"0.70"},"per stuk taart en € ",null,{"v":10,"d":"10.00"}," per foto"]
[]
[]
[]
[null,"Minimaal verbruik feest",null,null,950]
[]
[]
[]
[]
[null,"Maak in dit vak uw keuze voor het aperitief"]
[null,"1 aperitief per persoon",{"$nulls":6},{"v":6,"d":"€ 6.00"}]
[null,"2 aperitieven per persoon",{"$nulls":6},{"v":10,"d":"€ 10.00"}]
[null,"Receptie E",{"$nulls":6},{"v":12.600000000000001,"d":"€ 12.60"},null,"Maak in dit vak uw keuze voor het aperitief","1 aperitief per persoon","2 aperitieven per persoon","Receptie E","Receptie A",0,0,0,0,"Maak in dit vak uw keuze voor het aperitief","1 aperitief per persoon","2 aperitieven per persoon",0,"Receptie E",0,0,0,"Receptie A"]
[null,"Receptie A",{"$nulls":6},{"v":10,"d":"€ 10.00"},null,null,"1 per persoon,  ","2 per persoon,  ","Uitgebreide receptie","Basis receptie.",0,0,0,0,null,"vrije keuze","vrije keuze",0,"dranken inbegrepen",0,0,0,"dranken inbegrepen",{"$nulls":10},"Keuze aperitiefhapjes:"]
[null,0,{"$nulls":6},{"v":0,"d":"€ 0.00"},null,null,"eventueel tweede wordt","eventueel derde wordt","met 4 aperitiefglaasjes","Dranken 2 uur inbegrepen.",0,0,0,0,null,"Porto rood","Porto rood",0,"gedurende 2 uur",0,0,0,"gedurende 2 uur",{"$nulls":10},"KOUD: crunchy sushi"]
[null,0,{"$nulls":6},{"v":0,"d":"€ 0.00"},null,null,"direct afgerekend of","direct afgerekend of"," en drank gedurende 2 uur.","Met tapenades:",null,0,0,null,null,"Martini","Martini",0,"met huis schuimwijn,",0,0,0,"met huis schuimwijn,",{"$nulls":10},"luzerne met gerookte zalm, eitjes van vliegende vis in wasabi"]
[null,0,{"$nulls":6},{"v":0,"d":"€ 0.00"},null,null,"komt op 1 rekening","komt op 1 rekening",0,"tonijn / pesto spread rosso /zoete peper roomkaas",null,0,{"$nulls":3},"Kir","Kir",0,"frisdranken en",0,0,0,"frisdranken en",{"$nulls":10},"preischeuten met tijgergarnalen en mini tomaat"]
[null,0,{"$nulls":6},{"v":0,"d":"€ 0.00"},{"$nulls":5},0,{"$nulls":5},"Frisdrank","Frisdrank",0,"bieren naar believen.",null,0,0,"bieren naar believen.",{"$nulls":10},"aperoglaasje parmaham met meloenbolletjes"]
[{"$nulls":14},0,{"$nulls":5},"Bieren","Bieren",0,0,null,0,0,0,{"$nulls":10},"ganache van foie gras met frambozenconfituur en amandelbrood"]
[{"$nulls":14},0,{"$nulls":5},"nootjes en chips inbegr.","nootjes en chips inbegr.",0,"Assortiment van 4  ",null,0,0,"Ook inbegrepen:",{"$nulls":10},"aperoglaasje parmaham met espuma van mango"]
[{"$nulls":12},"Roomijs ",{"$nulls":7},"TIP:","TIP:",0,"aperitiefglaasjes",null,0,0,"tapenades",{"$nulls":10},"verse oester"]
[null,"Schuimwijn van het huis (reeds inbegrepen)",{"$nulls":6},{"v":0,"d":"€ 0.00"},{"$nulls":3},"Bruine chocolademousse",{"$nulls":7},"Receptie A","Receptie A",0,"inbegrepen.",null,0,0,"nootjes en chips",{"$nulls":10},"Taboulé met gerookte forel"]
[null,"Cava",{"$nulls":6},{"v":3.25,"d":"€ 3.25"},{"$nulls":3},"Pasteis de nata",{"$nulls":7},"kost evenveel als","kost evenveel als",0,"Maak uw keuze",null,0,0,0,{"$nulls":10},"Haringhapje met curry"]
[null,"Champagne",{"$nulls":6},{"v":7,"d":"€ 7.00"},{"$nulls":3},"Chocoladebavarois",{"$nulls":7},"2 aperitieven pp.","2 aperitieven pp.",0,"hier rechts! =>",null,0,0,{"$nulls":11},"Mini bagel met zalm en kruidenkaas"]
[{"$nulls":12},"Miserable",{"$nulls":7},"En dan is de drank naar","En dan is de drank naar",0,0,null,0,0,{"$nulls":11},"BORD: op tafel met rauwe groenten en cocktailsaus (wortel, bloemkool, radijs)"]
[{"$nulls":12},"glaasje fruitsla met perensorbet",{"$nulls":7},"believen!","believen!",0,"Liever meer dan 4 hapjes? Geen probleem.",null,0,0,{"$nulls":11},"Bord met olijven, kaasjes en salamietjes"]
[{"$nulls":12},"Witte chocolademousse ",{"$nulls":7},"En met tapenades!","En met tapenades!",0,"Het supplement bedraagt € 1,60 per hapje",null,0,0,{"$nulls":11},"Bord met 3 tapenades (tonijn / pesto spread rosso /zoete peper roomkaas)"]
[{"$nulls":12},"Roomsoes met warme chocoladesaus ",{"$nulls":25},"WARM: mini hot-dog"]
[null,"Dessertbuffet zonder maaltijd: ",{"$nulls":6},{"v":16.5,"d":"€ 16.50"},{"$nulls":3},"Tiramisu",{"$nulls":25},"Breydelspek met mosterdroomsaus"]
{"$rows_left_out":158}
{"sheet":"Algemene verkoopsvoorwaarden","index":2,"n_rows":63,"n_cols":13,"rows_kept":63}
[null,"Algemene verkoopsvoorwaarden:"]
[null,"1) Onze facturen zijn contant te betalen bij levering van de goederen. Bijgevolg zal in geval van laattijdige betaling"]
[null,"van rechtswege en zonder voorafgaande ingebrekestelling een intrest aangerekend worden van 12% per jaar op de "]
[null,"bedragen, verschuldigd acht dagen na de vervaldag van de facturen. Tevens zal bij gebrek aan betaling na "]
[null,"aanmaning bij gewone brief, het verschuldigde bedrag van rechtswege verhoogd worden met een forfaitaire"]
[null,"vergoeding van 12 % met een minimum van € 50  voor bijkomende administratieve kosten, debiteurenbewaking "]
[null,"en commerciële stoornissen. Wij behouden ons het recht voor op elk moment de leveringen te staken. Elke "]
[null,"klacht over de kwaliteit van de geleverde goederen moet uiterlijk 24 uur na de levering worden overgemaakt. "]
[null,"Klachten in verband met facturatie kunnen slechts in aanmerking worden genomen zo zij binnen de acht "]
[null,"dagen na ontvangst van de goederen bij aangetekende brief worden meegedeeld. In geval van betwisting zijn "]
[null,"uitsluitend de rechtbanken van Kortrijk bevoegd. De leveringen  geschieden op risico van de bestemmeling. Er "]
[null,"wordt uitdrukkelijk overeengekomen dat de klant door het plaatsen van een bestelling onze algemene "]
[null,"verkoopsvoorwaarden erkent. Elke wijziging hieraan moet voorafgaandelijk in een schriftelijk akkoord worden "]
[null,"vastgelegd."]
[]
[null,"2) Annulatie dient schriftelijk en gedateerd te geschieden. "]
[null,"In geval van annulatie minder dan 60 dagen voor de activiteit blijft het voorschot eigendom van het Katelijnenhof."]
[null,"Voor annulatie minder dan 10 dagen voor de activiteit is de klant in alle gevallen verplicht 35 % van de reservatie-"]
[null,"waarde van de gehele manifestatie te vergoeden."]
[null,"Bij annulatie minder dan 5 dagen voor  de activiteit is de klant in alle gevallen verplicht de reservatie waarde van de "]
[null,"gehele manifestatie te vergoeden."]
[]
[null,"3) Iedere levering van dranken, voedingswaren of diensten in de  zalen is uitsluitend voorbehouden aan het "]
[null,"Katelijnenhof, tenzij er een andere schriftelijke overeenkomst is."]
[]
[null,"4) De klant is eraan gehouden voor iedere dansavond met groot orkest een aanvraag tot toelating in te dienen bij "]
[null,"SABAM, Rijselsestraat 51, 8500 Kortrijk, Tel : 056/210738 en alle kosten voortvloeiend uit deze aanvraag te "]
[null,"dragen.  Voor een gewone disc-jockey betalen wij jaarlijks een vaste bijdrage. Het verbruik (drank en voeding) "]
[null,"van de DJ is ten laste van de klant. Gelet op de nieuwe geluidsnormen, van kracht op 01/01/2013, moet de "]
[null,"klant de DJ of elke andere persoon of toestel dat  geluid produceert verplichten zich aan deze normen te houden. "]
{"$rows_left_out":34}
{"sheet":"Reservatievoorstel","index":3,"n_rows":50,"n_cols":33,"rows_kept":50,"merged":[[2,14,3,14],[2,15,3,15],[2,16,3,16],[2,17,3,17],[9,12,9,13],[12,9,12,11],[12,12,12,16],[14,9,14,17],[16,9,16,17],[23,14,23,17],[25,9,26,17],[32,4,33,8],[36,0,37,8],[38,0,40,8],[43,0,44,7]]}
[null,null,"Reservatievoorstel    ",{"$nulls":7},"Uitsplitsing per BTW tarief.",{"$nulls":4},"Totaalprijs per vol:",{"$f":"D9","v":{"v":33.8,"d":"33.80"}}]
["Naam Klant:",null,{"$f":"'koud buffet'!F92","v":0},null,"Katelijnenhof",{"$nulls":9},{"$f":"IF(P2>0,\"Prijs drankforfait na de maaltijd, volledig aan 21% BTW:\",\"\")","v":"Prijs drankforfait na de maaltijd, volledig aan 21% BTW:"},{"$f":"IF(Q2>0,\"Prijs drankforfait na de maaltijd, volledig aan 21% BTW:\",\"\")","v":""},{"$f":"'koud buffet'!D76","v":{"v":0,"d":"0.00"}}]
["Adres:",null,{"$f":"'koud buffet'!F93","v":0},null,"Heirweg 172",null,null,"aankomst om:",{"$f":"'koud buffet'!F90","v":0},{"$nulls":3},"Menu",null,"Dep. B",{"$f":"IF(Q2>0,\"Drank- forfait:\",\"\")","v":""},"Totaal aan 21%","Dep. A"]
["Stad:",null,{"$f":"'koud buffet'!F94","v":0},null,"8800 Roeselare",null,null,"aan tafel om:",{"$f":"'koud buffet'!F91","v":0},null,"aantal","totaal:","deel 12%","deel21%"]
["Tel nr:",null,{"$f":"'koud buffet'!F95","v":0},null,"info@katelijnenhof.be",{"$nulls":4},"Vol",{"$f":"C9","v":0},{"$f":"Q1-Q2","v":{"v":33.8,"d":"33.80"}},{"$f":"ROUND(L5*0.65,2)","v":21.97},{"$f":"L5-M5","v":{"v":11.829999999999998,"d":"11.83"}},{"$f":"K5*M5","v":{"v":0,"d":"0.00"}},{"$f":"Q2","v":{"v":0,"d":"0.00"}},{"$f":"N5+P5","v":{"v":11.829999999999998,"d":"11.83"}},{"$f":"K5*Q5","v":{"v":0,"d":"0.00"}}]
[{"$f":"'koud buffet'!J103","v":"reden feest:"},{"$f":"'koud buffet'!K103","v":0},null,null,"Gsm 0475/618058",{"$nulls":4},"JR 1/2",{"$f":"C10","v":0},{"$f":"D10-P6","v":{"v":16.9,"d":"16.90"}},{"$f":"ROUND(L6*0.65,2)","v":10.99},{"$f":"L6-M6","v":{"v":5.909999999999998,"d":"5.91"}},{"$f":"K6*M6","v":{"v":0,"d":"0.00"}},{"$f":"ROUND(Q2/2,2)","v":{"v":0,"d":"0.00"}},{"$f":"N6+P6","v":{"v":5.909999999999998,"d":"5.91"}},{"$f":"K6*Q6","v":{"v":0,"d":"0.00"}}]
["Datum activiteit:",null,{"$f":"'koud buffet'!F83","v":"00:00:00"},null,"email klant:",{"$f":"'koud buffet'!F96","v":0},{"$nulls":3},"JR 1/3",{"$f":"C11","v":0},{"$f":"D11-P7","v":11.27},{"$f":"ROUND(L7*0.65,2)","v":7.33},{"$f":"L7-M7","v":{"v":3.9399999999999995,"d":"3.94"}},{"$f":"K7*M7","v":{"v":0,"d":"0.00"}},{"$f":"ROUND(Q2/3,2)","v":{"v":0,"d":"0.00"}},{"$f":"N7+P7","v":{"v":3.9399999999999995,"d":"3.94"}},{"$f":"K7*Q7","v":{"v":0,"d":"0.00"}}]
[null,null,"Totaal aantal personen: ",{"$f":"C9+C12+C11+C10","v":0},{"$nulls":3},"raming totaal 1:",{"$f":"C9*D9+C10*D10+C11*D11+C12*D12","v":{"v":0,"d":"€ 0.00"}},"JR gratis",{"$f":"C12","v":0},{"$f":"E12","v":{"v":0,"d":"0.00"}},{"$f":"L8*0.65","v":0},{"$f":"L8*0.35","v":{"v":0,"d":"0.00"}},{"$f":"K8*M8","v":{"v":0,"d":"0.00"}},null,{"$f":"N8+P8","v":0},{"$f":"K8*Q8","v":{"v":0,"d":"0.00"}}]
[null,"volwassenen:",{"$f":"'koud buffet'!F85","v":0},{"$f":"'koud buffet'!D7","v":{"v":33.8,"d":"33.80"}},{"$nulls":3},"ander rekenblad:",{"$f":"'koud buffet'!F98","v":{"v":0,"d":"€ 0.00"}},null,null,"Voorschot reeds betaald:",null,null,{"$f":"ROUND(M9/98*100,2)","v":0},{"$f":"IF(Q9>0,\"Huur zaal/exclusiviteit: \",\"\")","v":""},{"$f":"I10+I11","v":{"v":0,"d":"0.00"}}]
[null,"JR 1/2 (6 t.e.m. 11) :",{"$f":"'koud buffet'!F86","v":0},{"$f":"'koud buffet'!J7","v":{"v":16.9,"d":"16.90"}},{"$nulls":3},"huur zaal:",{"$f":"IF(D8=0,0,IF((I8+I9)<'Algemene verkoopsvoorwaarden'!J44,'Algemene verkoopsvoorwaarden'!J44-Reservatievoorstel!I8-Reservatievoorstel!I9,0))","v":{"v":0,"d":"€ 0.00"}},null,null,"Gestort / betaald op:"]
[null,"JR 1/3 (3 t.e.m. 5) :",{"$f":"'koud buffet'!F87","v":0},{"$f":"'koud buffet'!H7","v":11.27},{"$nulls":3},{"$f":"IF(I11>0,\"U koos voor exclusiviteit:\",\"\")","v":""},{"$f":"'koud buffet'!L74","v":{"v":0,"d":"€ 0.00"}},null,null,{"$f":"IF(O9>0,\"Voorschot uitgesplitst:\",\"\")","v":""},{"$f":"IF(O9>0,\" € \"&ROUND(O9*0.65,2)& \" x 12% => Dep. B  en € \" & ROUND(O9*0.35,2) & \" x 21% => Dep. A.\",\"\")","v":""}]
[null,"JR gratis (0 t.e.m. 2) :",{"$f":"'koud buffet'!F88","v":0},{"$f":"'koud buffet'!F7","v":"0,00"},{"$nulls":3},"raming algemeen totaal:",{"$f":"I10+I9+I8+I11","v":{"v":0,"d":"€ 0.00"}},{"$nulls":3},"Voorschot wordt gesplitst over:",{"$f":"IF(O9>0,ROUNDUP((O9+1)/L5,0),0)","v":0}," volwassenen"]
[{"$nulls":7},"raming te betalen indien contante betaling  (max € 3000 cash):",{"$f":"'koud buffet'!G104","v":{"v":0,"d":"€ 0.00"}},"Input GKS:",null,null,{"$f":"IF(O9*0.65 >N12*M5,\"ONMOGELIJK U bekomt negatieve waarden.\",\"\")","v":""}]
["Voorkeur tafelschikking:",null,null,{"$f":"'koud buffet'!K102","v":"geen voorkeur"},{"$nulls":5},{"$f":"N12","v":0},"vol","x",{"$f":"IFERROR(ROUND(M5-O9*0.65/N12,2),\"\")","v":""},{"v":0.12,"d":"12%"},{"$f":"IFERROR(J14*M14,\"\")","v":""},"Dep. B","Verwerking voorschot"]
[{"$f":"'koud buffet'!H84","v":""},{"$nulls":7},{"$f":"'koud buffet'!B20","v":"De gast die een extra aperitief bestelt betaalt deze zelf"},{"$f":"IFERROR( \" Er wordt € \" & ROUND(O9*0.65/N12,2) & \" minder geboekt bij \" & N12 & \" personen omdat dit reeds als voorschot werd geboekt.\",\"\")","v":""}]
[{"$f":"'koud buffet'!H85","v":""},{"$nulls":7},{"$f":"IF(O9>0,\" Uw voorschot van € \" & O9 & \" wordt nog in mindering gebracht\",\"\")","v":""},{"$f":"N12","v":0},"vol","x",{"$f":"IFERROR(ROUND(Q5-O9*0.35/N12,2),\"\")","v":""},{"v":0.21,"d":"21%"},{"$f":"IFERROR(J16*M16,\"\")","v":""},"Dep. A","Verwerking voorschot"]
[{"$f":"'koud buffet'!H86","v":""},{"$nulls":8},{"$f":"IFERROR( \" Er wordt € \" & ROUND(O9*0.35/N12,2) & \" minder geboekt bij \" & N12 & \" personen omdat dit reeds als voorschot werd geboekt.\",\"\")","v":""}]
[{"$f":"'koud buffet'!H87","v":""},{"$nulls":8},{"$f":"K5-J14","v":0},{"$f":"K14","v":"vol"},"x",{"$f":"M5","v":21.97},{"v":0.12,"d":"12%"},{"$f":"J18*M18","v":{"v":0,"d":"0.00"}},"Dep. B"]
[{"$f":"'koud buffet'!H88","v":""},{"$nulls":8},{"$f":"K5-J16","v":0},{"$f":"K16","v":"vol"},"x",{"$f":"Q5","v":{"v":11.829999999999998,"d":"11.83"}},{"v":0.21,"d":"21%"},{"v":0,"d":"0.00"},"Dep. A"]
[{"$f":"'koud buffet'!H89","v":""},{"$nulls":8},{"$f":"K6","v":0},{"$f":"J6","v":"JR 1/2"},"x",{"$f":"M6","v":10.99},{"v":0.12,"d":"12%"},{"v":0,"d":"0.00"},"Dep. B"]
[{"$f":"'koud buffet'!H90","v":""},{"$nulls":8},{"$f":"K6","v":0},{"$f":"J6","v":"JR 1/2"},"x",{"$f":"Q6","v":{"v":5.909999999999998,"d":"5.91"}},{"v":0.21,"d":"21%"},{"v":0,"d":"0.00"},"Dep. A"]
[{"$f":"'koud buffet'!H91","v":"Koude aardappelen"},{"$nulls":5},{"$f":"'koud buffet'!H92","v":"Groenten en sausen "},null,null,{"$f":"K7","v":0},{"$f":"J7","v":"JR 1/3"},"x",{"$f":"M7","v":7.33},{"v":0.12,"d":"12%"},{"v":0,"d":"0.00"},"Dep. B"]
["Koud buffet met volgende specialiteiten:",{"$nulls":3},{"$f":"IF('koud buffet'!B50=$AG$23,\"\",'koud buffet'!B50)","v":""},{"$nulls":3},{"$f":"IF('koud buffet'!F50=$AG$25,\"\",'koud buffet'!F50)","v":""},{"$f":"K7","v":0},{"$f":"J7","v":"JR 1/3"},"x",{"$f":"Q7","v":{"v":3.9399999999999995,"d":"3.94"}},{"v":0.21,"d":"21%"},{"v":0,"d":"0.00"},"Dep. A",{"$nulls":16},{"$f":"matrixen!B97","v":"Kies uit deze vlees- of visspecialiteiten"}]
[{"$f":"IF('koud buffet'!B39=$AG$23,\"\",'koud buffet'!B39)","v":""},{"$nulls":3},{"$f":"IF('koud buffet'!F39=$AG$24,\"\",'koud buffet'!F39)","v":""},{"$nulls":3},{"$f":"IF('koud buffet'!F51=$AG$25,\"\",'koud buffet'!F51)","v":""},{"$f":"IF(L24>0,\"1\",0)","v":0},{"$f":"IF(L24>0,\"x\",\"\")","v":""},{"$f":"Q9","v":{"v":0,"d":"0.00"}},{"$f":"IF(L24>0,\"21%\",\"\")","v":""},{"$f":"IF(L24>0,\"Dep. A\",\"\")","v":""},{"$f":"P9","v":""},{"$nulls":17},{"$f":"matrixen!E97","v":"supplement 1"}]
[{"$f":"IF('koud buffet'!B40=$AG$23,\"\",'koud buffet'!B40)","v":""},{"$nulls":3},{"$f":"IF('koud buffet'!F40=$AG$24,\"\",'koud buffet'!F40)","v":""},{"$nulls":3},{"$f":"IF('koud buffet'!F52=$AG$25,\"\",'koud buffet'!F52)","v":""},null,"Totale boekwaarde:",{"$f":"SUM(O14:O23)+L24+O9+I9","v":{"v":0,"d":"0.00"}},{"$f":"IF(SUM(O14:O23)+L24+O9+I9 <>I12,\" Er is iets fout met de splitsingstabel\",\"\")","v":""},{"$nulls":19},{"$f":"matrixen!H97","v":"supplement 2"}]
[{"$f":"IF('koud buffet'!B41=$AG$23,\"\",'koud buffet'!B41)","v":""},{"$nulls":3},{"$f":"IF('koud buffet'!F41=$AG$24,\"\",'koud buffet'!F41)","v":""},{"$nulls":4},{"$f":"\"De eventuele korting contant van 2 %, in het huidig voorstel is dit € \" &ROUND( I12-I13,2) & \" is nog niet in bovenstaande splitsing verwerkt.\"","v":"De eventuele korting contant van 2 %, in het huidig voorstel is dit € 0 is nog niet in bovenstaande splitsing verwerkt."}]
[{"$f":"IF('koud buffet'!B42=$AG$23,\"\",'koud buffet'!B42)","v":""},{"$nulls":3},{"$f":"IF('koud buffet'!F42=$AG$24,\"\",'koud buffet'!F42)","v":""}]
[{"$f":"IF('koud buffet'!B43=$AG$23,\"\",'koud buffet'!B43)","v":""},{"$nulls":3},{"$f":"IF('koud buffet'!F43=$AG$24,\"\",'koud buffet'!F43)","v":""},{"$nulls":4},{"$f":"IF(M28<>\"\",\"Detail van het aperitief:\",\"\")","v":""},null,null,{"$f":"A15","v":""},{"$nulls":4},{"$f":"'koud buffet'!F13","v":0}]
[{"$f":"IF('koud buffet'!B44=$AG$23,\"\",'koud buffet'!B44)","v":""},{"$nulls":3},{"$f":"IF('koud buffet'!F44=$AG$24,\"\",'koud buffet'!F44)","v":""},{"$nulls":12},{"$f":"'koud buffet'!F14","v":0}]
[{"$f":"IF('koud buffet'!B45=$AG$23,\"\",'koud buffet'!B45)","v":""},{"$nulls":3},{"$f":"IF('koud buffet'!F45=$AG$24,\"\",'koud buffet'!F45)","v":""},{"$nulls":4},{"$f":"'koud buffet'!G13","v":0},{"$nulls":7},{"$f":"'koud buffet'!F15","v":0}]
{"$rows_left_out":20}