{"text_format":"3","workbook":"xlsx","n_sheets":4,"sheets":["menu's","matrixen","Algemene verkoopsvoorwaarden","Reservatievoorstel"],"not_rendered":{"macros":1,"defined_names":5},"read":"whole","date_system":"1900"}

{"sheet":"menu's","index":0,"n_rows":381,"n_cols":34,"rows_kept":381,"merged":[[12,6,12,10],[13,6,13,10],[14,6,14,10],[15,6,15,10],[16,6,16,10],[17,6,17,10],[18,6,18,10],[19,6,19,10],[20,6,20,10],[21,6,21,10],[22,6,22,10],[51,5,52,8],[89,5,89,7],[90,5,90,7],[91,5,91,7],[92,5,92,7],[96,11,96,13],[126,3,126,6]]}
[null,"Deze info is van: Feestzaal Katelijnenhof, Heirweg 172, 8800 Roeselare. Contacteer de zaakvoerder: 0475/618058 - info@katelijnenhof.be - web: www.katelijnenhof.be met foto's en volledige prijslijst."]
[]
[null,{"$f":"\"Rekenmodule menu's. \" & matrixen!B1","v":"Rekenmodule menu's. Prijzen geldig tot 31/08/2023"}]
[]
[{"$nulls":5},"kinderen",null,"kinderen",null,"kinderen"]
[{"$nulls":3},{"$f":"IF(TODAY()>AA11,\"Deze module is niet meer geldig.\",\"Deze prijzen zijn pas geldig van zodra u een hoofdschotel koos.\")","v":"Deze prijzen zijn pas geldig van zodra u een hoofdschotel koos."},null," 0 t.e.m. 2 j. 11 maand",null,"3 j. t.e.m. 5 j. 11 maand",null,"6 j, t.e.m. 11 jr. 11 maand"]
[null,"Totaal per volwassene:",null,{"$f":"SUM(D10:D1023)","v":{"v":0,"d":"0.00"}},null,"0,00",null,{"$f":"ROUND(D7/3,2)","v":{"v":0,"d":"0.00"}},null,{"$f":"ROUND(D7/2,2)","v":{"v":0,"d":"0.00"}}]
[{"$nulls":5},"U kan ook voor de kinderen een kindermenu nemen ( zie een andere rekenmodule)"]
[]
[null,"MAAK STEEDS UW KEUZE in de gele vakken: (scroll naar beneden om meer gegevens in te vullen) Hierboven kunt u uw prijs volgen.",{"$nulls":6},"U vindt verder een overzicht van uw selectie"]
[null,"(klik op de gele balk, vervolgens op het pijltje rechts en scroll ev. naar beneden)",null,"prijs pp",null,"Gedetailleerde info","Selecteer hier uw hapjes:",null,{"$f":"COUNTA(G13:K23)","v":0},"hapjes geselecteerd.",{"$nulls":16},{"$f":"matrixen!B1","v":"Prijzen geldig tot 31/08/2023"}]
[]
[null,"Maak in dit vak uw keuze voor het aperitief",null,{"$f":"VLOOKUP(B13,matrixen!B11:I19,8,FALSE)","v":{"v":0,"d":"0.00"}},null,{"$f":"HLOOKUP($B$13,matrixen!$T$14:$AB$28,2,FALSE)","v":0},{"$nulls":20},{"$f":"matrixen!B11","v":"Maak in dit vak uw keuze voor het aperitief"},{"$nulls":5},{"$f":"matrixen!AM16","v":"BORD"}]
[null,"Maak in dit vak uw keuze voor het aperitief",{"$nulls":3},{"$f":"HLOOKUP($B$13,matrixen!$T$14:$AB$28,3,FALSE)","v":0},{"$nulls":20},{"$f":"matrixen!B12","v":"1 aperitief per persoon"},{"$nulls":5},{"$f":"matrixen!AM17","v":"Bord met rauwe groenten en cocktailsaus (wortel, bloemkool, radijs)"}]
[null,{"$f":"\"U selecteerde tot nu \" & COUNTA(G13:K23)+IF(G24<>\"\",1,0)& \" hapjes.\"","v":"U selecteerde tot nu 0 hapjes."},null,{"$f":"IF(IF(B13=matrixen!N14,(I11-4)*matrixen!I47,I11*matrixen!I47)<0,0,IF(B13=matrixen!N14,(I11-4)*matrixen!I47,I11*matrixen!I47))","v":{"v":0,"d":"0.00"}},null,{"$f":"HLOOKUP($B$13,matrixen!$T$14:$AB$28,4,FALSE)","v":0},{"$nulls":20},{"$f":"matrixen!B13","v":"2 aperitieven per persoon"},{"$nulls":5},{"$f":"matrixen!AM18","v":"Bord met olijven, kaasjes en salamietjes"}]
[null,{"$f":"IF(B13=matrixen!N14,\"U koos receptie E en daar zijn 4 hapjes inbegrepen. Selecteer er dus zeker 4!\",\"\")","v":""},null,{"$f":"IF(F101=0,0,IF(YEAR(F101)=2018,-2,0))","v":{"v":0,"d":"0.00"}},null,{"$f":"HLOOKUP($B$13,matrixen!$T$14:$AB$28,5,FALSE)","v":0},{"$nulls":20},{"$f":"matrixen!B14","v":"Receptie E"},{"$nulls":5},{"$f":"matrixen!AM19","v":"Bord met 3 tapenades (tonijn / pesto spread rosso /zoete peper roomkaas)"}]
[{"$nulls":5},{"$f":"HLOOKUP($B$13,matrixen!$T$14:$AB$28,6,FALSE)","v":0},{"$nulls":20},{"$f":"matrixen!B15","v":"Receptie A"},{"$nulls":5},{"$f":"matrixen!AM20","v":"KOUD"}]
[{"$nulls":5},{"$f":"HLOOKUP($B$13,matrixen!$T$14:$AB$28,7,FALSE)","v":0},{"$nulls":20},{"$f":"matrixen!B16","v":0},{"$nulls":5},{"$f":"matrixen!AM21","v":"crunchy sushi"}]
[null,"Indien een genodigde een extra aperitief bestelt of een aperitief wenst die niet in de prijs begrepen is dan:",{"$nulls":3},{"$f":"HLOOKUP($B$13,matrixen!$T$14:$AB$28,8,FALSE)","v":0},{"$nulls":20},{"$f":"matrixen!B17","v":0},{"$nulls":5},{"$f":"matrixen!AM22","v":"luzerne met gerookte zalm, eitjes van vliegende vis in wasabi"}]
[null,"De gast die niet inbegrepen aperitief bestelt betaalt deze zelf (vb: sterke drank)",{"$nulls":3},{"$f":"HLOOKUP($B$13,matrixen!$T$14:$AB$28,9,FALSE)","v":0},{"$nulls":20},{"$f":"matrixen!B18","v":0},{"$nulls":5},{"$f":"matrixen!AM23","v":"preischeuten met tijgergarnalen en mini tomaat"}]
[null,"De gast die niet inbegrepen aperitief bestelt betaalt deze zelf (vb: sterke drank)",{"$nulls":3},{"$f":"HLOOKUP($B$13,matrixen!$T$14:$AB$28,10,FALSE)","v":0},{"$nulls":20},{"$f":"matrixen!B19","v":0},{"$nulls":5},{"$f":"matrixen!AM24","v":"aperoglaasje parmaham met meloenbolletjes"}]
[null,"De gast die een extra aperitief bestelt betaalt deze zelf",{"$nulls":3},{"$f":"HLOOKUP($B$13,matrixen!$T$14:$AB$28,11,FALSE)","v":0},{"$nulls":26},{"$f":"matrixen!AM25","v":"ganache van foie gras met frambozenconfituur en amandelbrood"}]
[{"$nulls":5},{"$f":"HLOOKUP($B$13,matrixen!$T$14:$AB$28,12,FALSE)","v":0},{"$nulls":26},{"$f":"matrixen!AM26","v":"aperoglaasje parmaham met espuma van mango"}]
[{"$nulls":5},{"$f":"HLOOKUP($B$13,matrixen!$T$14:$AB$28,13,FALSE)","v":0},{"$f":"IF(F20=\"tapenades\", matrixen!AM19 & \" nootjes en chips\",\"\")","v":""},{"$nulls":25},{"$f":"matrixen!AM27","v":"verse oester"}]
[{"$nulls":5},{"$f":"HLOOKUP($B$13,matrixen!$T$14:$AB$28,14,FALSE)","v":0},{"$nulls":20},{"$f":"matrixen!B23","v":"Schuimwijn van het huis (reeds inbegrepen)"},{"$nulls":5},{"$f":"matrixen!AM28","v":"Taboulé met gerookte forel"}]
[{"$nulls":5},{"$f":"HLOOKUP($B$13,matrixen!$T$14:$AB$28,15,FALSE)","v":0},{"$nulls":20},{"$f":"matrixen!B24","v":"Cava"},{"$nulls":5},{"$f":"matrixen!AM29","v":"Haringhapje met curry"}]
[{"$nulls":26},{"$f":"matrixen!B25","v":"Champagne"},{"$nulls":5},{"$f":"matrixen!AM30","v":"Mini bagel met zalm en kruidenkaas"}]
[null,"Stel vanaf hier zelf uw menu's samen!",{"$nulls":24},{"$f":"matrixen!B26","v":0},{"$nulls":5},{"$f":"matrixen!AM31","v":"SOEP"}]
[{"$nulls":32},{"$f":"matrixen!AM32","v":"Kreeftensoep"}]
[null,"I Koud voorgerecht.",{"$nulls":24},{"$f":"matrixen!B44","v":"Maak hier uw keuze voor extra hapjes bij het aperitief"},{"$nulls":5},{"$f":"matrixen!AM33","v":"Aspergeroomsoep met koornbloemblaadjes"}]
{"$rows_left_out":244}
{"sheet":"matrixen","index":1,"n_rows":523,"n_cols":39,"rows_kept":523,"hidden":true}
[null,"Prijzen geldig tot 31/08/2023",{"$nulls":9},"lam, zwanen enz..  . Met foto suppl.",{"$nulls":3},15]
[{"$nulls":11},"Foto op de taart: suppl. € ",null,null,1,"per stuk taart en € ",null,12," per foto"]
[]
[null,"Minimaal verbruik feest",null,null,1250]
[]
[{"$nulls":7},"De naam van alle gerechten wordt niet automatisch aangepast."]
[{"$nulls":7},"Sommige moeten manueel aangepast worden!"]
[{"$nulls":7},"Op deze pagina staan ze in 't oranje"]
[]
[]
[null,"Maak in dit vak uw keuze voor het aperitief"]
[null,"1 aperitief per persoon",{"$nulls":6},{"v":6,"d":"€ 6.00"}]
[null,"2 aperitieven per persoon",{"$nulls":6},{"v":12,"d":"€ 12.00"}]
[null,"Receptie E",{"$nulls":6},{"v":12.600000000000001,"d":"€ 12.60"},null,"Maak in dit vak uw keuze voor het aperitief","1 aperitief per persoon","2 aperitieven per persoon","Receptie E","Receptie A",0,0,0,0,"Maak in dit vak uw keuze voor het aperitief","1 aperitief per persoon","2 aperitieven per persoon",0,"Receptie E",0,0,0,"Receptie A"]
[null,"Receptie A",{"$nulls":6},{"v":10,"d":"€ 10.00"},null,null,"1 per persoon,  ","2 per persoon,  ","Uitgebreide receptie","Basis receptie.",0,0,0,0,null,"vrije keuze","vrije keuze",0,"dranken inbegrepen",0,0,0,"dranken inbegrepen",{"$nulls":10},"Keuze aperitiefhapjes:"]
[null,0,{"$nulls":6},{"v":0,"d":"€ 0.00"},null,null,"eventueel tweede wordt","eventueel derde wordt","met 4 aperitiefglaasjes","Dranken 2 uur inbegrepen.",0,0,0,0,null,"Porto rood","Porto rood",0,"gedurende 2 uur",0,0,0,"gedurende 2 uur",{"$nulls":10},"BORD"]
[null,0,{"$nulls":6},{"v":0,"d":"€ 0.00"},null,null,"direct afgerekend of","direct afgerekend of"," en drank gedurende 2 uur.","Met tapenades:",null,0,0,null,null,"Martini","Martini",0,"met huis schuimwijn,",0,0,0,"met huis schuimwijn,",{"$nulls":10},"Bord met rauwe groenten en cocktailsaus (wortel, bloemkool, radijs)"]
[null,0,{"$nulls":6},{"v":0,"d":"€ 0.00"},null,null,"komt op 1 rekening","komt op 1 rekening",0,"tonijn / pesto spread rosso /zoete peper roomkaas",null,0,{"$nulls":3},"Kir","Kir",0,"frisdranken en",0,0,0,"frisdranken en",{"$nulls":10},"Bord met olijven, kaasjes en salamietjes"]
[null,0,{"$nulls":6},{"v":0,"d":"€ 0.00"},{"$nulls":5},0,{"$nulls":5},"Frisdrank","Frisdrank",0,"bieren naar believen.",null,0,0,"bieren naar believen.",{"$nulls":10},"Bord met 3 tapenades (tonijn / pesto spread rosso /zoete peper roomkaas)"]
[{"$nulls":14},0,{"$nulls":5},"Bieren","Bieren",0,0,null,0,0,0,{"$nulls":10},"KOUD"]
[{"$nulls":14},0,{"$nulls":5},"nootjes en chips inbegr.","nootjes en chips inbegr.",0,"Assortiment van 4  ",null,0,0,"Ook inbegrepen:",{"$nulls":10},"crunchy sushi"]
[{"$nulls":12},"Roomijs ",{"$nulls":7},"TIP:","TIP:",0,"aperitiefglaasjes",null,0,0,"tapenades",{"$nulls":10},"luzerne met gerookte zalm, eitjes van vliegende vis in wasabi"]
[null,"Schuimwijn van het huis (reeds inbegrepen)",{"$nulls":6},{"v":0,"d":"€ 0.00"},{"$nulls":3},"Bruine chocolademousse",{"$nulls":7},"Receptie A","Receptie A",0,"inbegrepen.",null,0,0,"nootjes en chips",{"$nulls":10},"preischeuten met tijgergarnalen en mini tomaat"]
[null,"Cava",{"$nulls":6},{"v":3.5,"d":"€ 3.50"},{"$nulls":3},"Pasteis de nata",{"$nulls":7},"kost evenveel als","kost evenveel als",0,"Maak uw keuze",null,0,0,0,{"$nulls":10},"aperoglaasje parmaham met meloenbolletjes"]
[null,"Champagne",{"$nulls":6},{"v":7,"d":"€ 7.00"},{"$nulls":3},"Chocoladebavarois",{"$nulls":7},"2 aperitieven pp.","2 aperitieven pp.",0,"hier rechts! =>",null,0,0,0,{"$nulls":10},"ganache van foie gras met frambozenconfituur en amandelbrood"]
[{"$nulls":12},"Miserable",{"$nulls":7},"En dan is de drank naar","En dan is de drank naar",0,0,null,0,0,0,{"$nulls":10},"aperoglaasje parmaham met espuma van mango"]
[{"$nulls":12},"glaasje fruitsla met perensorbet",{"$nulls":7},"believen!","believen!",0,"Liever meer dan 4 hapjes? Geen probleem.",null,0,0,0,{"$nulls":10},"verse oester"]
[{"$nulls":12},"Witte chocolademousse ",{"$nulls":7},"En met tapenades!","En met tapenades!",0,"Het supplement bedraagt € 1,60 per hapje",null,0,0,0,{"$nulls":10},"Taboulé met gerookte forel"]
[{"$nulls":12},"Roomsoes met warme chocoladesaus ",{"$nulls":25},"Haringhapje met curry"]
[null,"Dessertbuffet zonder maaltijd: ",{"$nulls":6},{"v":18,"d":"€ 18.00"},{"$nulls":3},"Tiramisu",{"$nulls":25},"Mini bagel met zalm en kruidenkaas"]
{"$rows_left_out":342}
{"sheet":"Algemene verkoopsvoorwaarden","index":2,"n_rows":39,"n_cols":1,"rows_kept":39}
["Algemene verkoopsvoorwaarden vanaf 01/11/2022:"]
[]
["1) Onze facturen zijn contant te betalen bij levering van de goederen, dit is de dag van het event. Bijgevolg zal in geval van laattijdige betaling van rechtswege en zonder voorafgaande ingebrekestelling een intrest aangerekend worden van 12% per jaar op de bedragen, verschuldigd acht dagen na de vervaldag van de facturen. Tevens zal bij gebrek aan betaling na aanmaning bij gewone brief, het verschuldigde bedrag van rechtswege verhoogd worden met een forfaitaire vergoeding van 12 % met een minimum van € 50  voor bijkomende administratieve kosten, debiteurenbewaking en commerciële stoornissen. Wij behouden ons het recht voor op elk moment de leveringen te staken. Elke klacht over de kwaliteit van de geleverde goederen moet uiterlijk 24 uur na de levering worden overgemaakt. "]
["Klachten in verband met facturatie kunnen slechts in aanmerking worden genomen zo zij binnen de acht dagen na ontvangst van de goederen bij aangetekende brief worden meegedeeld. In geval van betwisting zijn uitsluitend de rechtbanken van Kortrijk bevoegd. De leveringen  geschieden op risico van de bestemmeling. Er wordt uitdrukkelijk overeengekomen dat de klant door het plaatsen van een bestelling onze algemene verkoopsvoorwaarden erkent. Elke wijziging hieraan moet voorafgaandelijk in een schriftelijk akkoord worden vastgelegd."]
[]
["2) Annulatie dient schriftelijk en gedateerd te geschieden. "]
["In geval van annulatie minder dan 60 dagen voor de activiteit blijft het voorschot eigendom van het Katelijnenhof. Voor annulatie minder dan 10 dagen voor de activiteit is de klant in alle gevallen verplicht 35 % van de reservatie waarde van de gehele manifestatie te vergoeden. Bij annulatie minder dan 5 dagen voor  de activiteit is de klant in alle gevallen verplicht de reservatie waarde van de gehele manifestatie te vergoeden."]
[]
["3) Iedere levering van dranken, voedingswaren of diensten in de  zalen is uitsluitend voorbehouden aan het Katelijnenhof, tenzij er een andere schriftelijke overeenkomst is."]
[]
["4) De klant is eraan gehouden voor iedere dansavond met groot orkest een aanvraag tot toelating in te dienen bij SABAM, Rijselsestraat 51, 8500 Kortrijk, Tel : 056/210738 en alle kosten voortvloeiend uit deze aanvraag te dragen.  Voor een gewone disc-jockey betalen wij jaarlijks een vaste bijdrage. Het verbruik (drank en voeding) van de DJ is ten laste van de klant. Gelet op de nieuwe geluidsnormen, van kracht op 01/01/2013, moet de klant de DJ of elke andere persoon of toestel dat  geluid produceert verplichten zich aan deze normen te houden. De toelating voor onze zaal is – maximaal geluidsniveau > 85 dB(A) LAeq,15min en ≤ 95 dB(A) LAeq,15min. Dit is ruim voldoende. Alle boetes ten gevolge een overschrijding van deze voorwaarde zijn ten laste van de klant. Er wordt een professionele houding van elke DJ of geluidstechnicus verwacht."]
["Het is niet toegestaan om muziek af te spelen via B2C diensten zoals Spotify, Deezer, Youtube… Dit geldt voor elke horecazaak, winkel enz… Doet de klant of zijn DJ dat toch en er volgt een boete, dan is deze ten laste van de klant."]
[]
["5) Alle door de klant meegebrachte materiaal dient door de klant te worden verzekerd en direct na het beëindigen van de manifestatie te worden verwijderd uit de zaal. Het Katelijnenhof behoudt het recht de leverancier te aanvaarden en voorschriften te geven om de lokalen ongeschonden te behouden. Het is strikt verboden om versieringen aan de muren of plafonds te bevestigen met duimspijkers of kleefband ! Bij beschadigingen van een deel van de muur wordt het geheel als beschadigd beschouwd."]
[]
["6) Het gebruik van de zaal is strikt beperkt tot de in deze overeenkomst vastgestelde functie. Iedere wijziging in de voorheen verklaarde bestemming brengt automatisch het recht tot prijsherziening met zich mee."]
[]
["7) Het gebruik van de zaal is gratis van zodra het verbruik hoger ligt dan € 1250. Indien het verbruik lager ligt, wordt het factuurbedrag opgetrokken tot € 1250. Indien uw feest cash (max € 3000) of met Payconiq betaald wordt op de dag zelf krijgt u een korting van 2 % op de gehele factuur. Voor traiteurdienst gelden andere kortingsregels. Vanaf 01/04/23 wordt bancontact niet meer aanvaard!! "]
["Wie geen Payconiq heeft moet op voorhand storten om de korting te bekomen."]
[]
["8) Sluitingsuren zaal:"]
[]
["In geval van een event dat start ’s morgens start tussen 7u en 10u59 (vb. ontbijt)"]
["Event kan maximaal 6 uur duren."]
[]
["In geval van een event dat start op de middag start tussen 11u en 13u59"]
["De bar sluit om 18u00, de zaal sluit om 18u30."]
[]
["In geval van een event dat start in de namiddag start tussen 14u en 17u59 (vb. babyborrel)"]
["Event kan maximaal 6 uur duren."]
{"$rows_left_out":10}
{"sheet":"Reservatievoorstel","index":3,"n_rows":50,"n_cols":20,"rows_kept":50,"merged":[[2,14,3,14],[2,15,3,15],[2,16,3,16],[2,17,3,17],[9,12,9,13],[12,9,12,11],[12,12,12,16],[14,9,14,17],[15,5,15,8],[16,9,16,17],[18,2,18,8],[19,3,20,8],[23,14,23,17],[25,0,25,8],[25,9,26,17],[28,0,28,8],[34,0,34,8],[34,13,34,17],[35,13,35,17],[39,0,40,8],[41,0,43,8],[48,9,48,15]]}
[null,null,{"$f":"\"Reservatievoorstel. \" & matrixen!B1","v":"Reservatievoorstel. Prijzen geldig tot 31/08/2023"},{"$nulls":7},"Uitsplitsing per BTW tarief.",{"$nulls":4},"Totaalprijs per vol:",{"$f":"E9","v":{"v":0,"d":"0.00"}}]
["Naam Klant:",null,{"$f":"'menu''s'!F110","v":0},{"$nulls":3},"Katelijnenhof",{"$nulls":8},{"$f":"IF(Q2>0,\"Prijs drankforfait na de maaltijd, 50/50 aan 21%/6% BTW:\",\"\")","v":""},{"$f":"'menu''s'!D95","v":{"v":0,"d":"0.00"}}]
["Adres:",null,{"$f":"'menu''s'!F111","v":0},{"$nulls":3},"Heirweg 172",{"$nulls":5},"Menu",null,"Dep. B",{"$f":"IF(Q2>0,\"Drank- forfait:\",\"\")","v":""},"Totaal aan 21%","Dep. A"]
["Stad:",null,{"$f":"'menu''s'!F112","v":0},{"$nulls":3},"8800 Roeselare",{"$nulls":3},"aantal","totaal:","deel 12%","deel21%"]
["Tel nr:",null,{"$f":"'menu''s'!F113","v":0},{"$nulls":3},"info@katelijnenhof.be",null,null,"Vol",{"$f":"D9","v":0},{"$f":"Q1","v":{"v":0,"d":"0.00"}},{"$f":"ROUND((L5-$Q$2)*0.65,2)","v":{"v":0,"d":"0.00"}},{"$f":"L5-M5","v":{"v":0,"d":"0.00"}},{"$f":"K5*M5","v":{"v":0,"d":"0.00"}},{"$f":"Q2","v":{"v":0,"d":"0.00"}},{"$f":"N5","v":{"v":0,"d":"0.00"}},{"$f":"K5*Q5","v":{"v":0,"d":"0.00"}}]
[{"$f":"'menu''s'!E124","v":"Reden feest:"},{"$f":"'menu''s'!F124","v":0},{"$nulls":4},"Gsm 0475/618058",null,null,"JR 1/2",{"$f":"D10","v":0},{"$f":"E10","v":{"v":0,"d":"0.00"}},{"$f":"ROUND((L6-$Q$2/2)*0.65,2)","v":{"v":0,"d":"0.00"}},{"$f":"L6-M6","v":{"v":0,"d":"0.00"}},{"$f":"K6*M6","v":{"v":0,"d":"0.00"}},{"$f":"ROUND($Q$2/2,2)","v":{"v":0,"d":"0.00"}},{"$f":"N6","v":{"v":0,"d":"0.00"}},{"$f":"K6*Q6","v":{"v":0,"d":"0.00"}}]
["Datum activiteit:",null,{"$f":"'menu''s'!F101","v":"00:00:00"},null,"email klant:",{"$f":"'menu''s'!F114","v":0},{"$nulls":3},"JR 1/3",{"$f":"D11","v":0},{"$f":"E11","v":{"v":0,"d":"0.00"}},{"$f":"ROUND((L7-$Q$2/3)*0.65,2)","v":{"v":0,"d":"0.00"}},{"$f":"L7-M7","v":{"v":0,"d":"0.00"}},{"$f":"K7*M7","v":{"v":0,"d":"0.00"}},{"$f":"ROUND($Q$2/3,2)","v":{"v":0,"d":"0.00"}},{"$f":"N7","v":{"v":0,"d":"0.00"}},{"$f":"K7*Q7","v":{"v":0,"d":"0.00"}}]
["Totaal aantal personen:",null,null,{"$f":"D9+D10+D11+D12","v":0},"prijs:",null,"aankomst om:",{"$f":"'menu''s'!F108","v":0},null,"JR gratis",{"$f":"D12","v":0},{"$f":"E12","v":"0,00"},{"$f":"L8*0.65","v":0},{"$f":"L8*0.35","v":{"v":0,"d":"0.00"}},{"$f":"K8*M8","v":{"v":0,"d":"0.00"}},null,{"$f":"N8+P8","v":0},{"$f":"K8*Q8","v":{"v":0,"d":"0.00"}}]
[null,null,"volwassenen:",{"$f":"'menu''s'!F103","v":0},{"$f":"'menu''s'!D7","v":{"v":0,"d":"0.00"}},null,"aan tafel om:",{"$f":"'menu''s'!F109","v":0},{"$nulls":3},"Voorschot reeds betaald:",null,"waarde:",{"$f":"ROUND(M9/98*100,2)","v":0},{"$f":"IF(Q9>0,\"Huur zaal/exclusiviteit \",\"\")","v":""},{"$f":"+H12","v":{"v":0,"d":"0.00"}}]
[null,null,"JR 1/2 (6 t.e.m. 11) :",{"$f":"'menu''s'!F104","v":0},{"$f":"'menu''s'!J7","v":{"v":0,"d":"0.00"}},null,"raming totaal 1:",{"$f":"D9*E9+D10*E10+D11*E11+D12*E12","v":{"v":0,"d":"€ 0.00"}},{"$nulls":3},"Gestort / betaald op:"]
[null,null,"JR 1/3 (3 t.e.m. 5) :",{"$f":"'menu''s'!F105","v":0},{"$f":"'menu''s'!H7","v":{"v":0,"d":"0.00"}},null,"ander rekenblad:",{"$f":"'menu''s'!F115","v":{"v":0,"d":"€ 0.00"}},{"$nulls":3},{"$f":"IF(O9>0,\"Voorschot uitgesplitst:\",\"\")","v":""},{"$f":"IF(O9>0,\" € \"&ROUND(O9*0.825,2) & \" x 6% => Dep. B  en € \" & ROUND(O9*0.175,2) & \" x 21% => Dep. A.\",\"\")","v":""}]
[null,null,"JR gratis (0 t.e.m. 2) :",{"$f":"'menu''s'!F106","v":0},{"$f":"'menu''s'!F7","v":"0,00"},null,"huur zaal:",{"$f":"IF(D8=0,0,IF((H10+H11)<matrixen!E4,(matrixen!E4-Reservatievoorstel!H10-Reservatievoorstel!H11),0))","v":{"v":0,"d":"€ 0.00"}},{"$nulls":4},"Voorschot wordt gesplitst over:",{"$f":"IF(O9>0,ROUNDUP(((O9+1)/L5),0),0)","v":0}," volwassenen"]
[{"$nulls":6},{"$f":"IF(H13>0,\"U koos exclusiviteit: \",\"\")","v":""},{"$f":"'menu''s'!F132","v":{"v":0,"d":"€ 0.00"}},null,"Input GKS:",null,null,{"$f":"IF(O9*0.825 >N12*M5,\"ONMOGELIJK U bekomt negatieve waarden.\",\"\")","v":""}]
[{"$nulls":6},"raming algemeen totaal:",{"$f":"H10+H11+H12+H13","v":{"v":0,"d":"€ 0.00"}},null,{"$f":"N12","v":0},"vol","x",{"$f":"IFERROR(ROUND(M5-O9*0.825/N12,2),\"\")","v":""},{"v":0.12,"d":"12%"},{"$f":"IFERROR(J14*M14,\"\")","v":""},"Dep. B","Verwerking voorschot"]
[{"$nulls":6},"raming te betalen indien contante betaling  (max € 3000 cash):",{"$f":"'menu''s'!F122","v":{"v":0,"d":"€ 0.00"}},null,{"$f":"IFERROR( \" Er wordt € \" & ROUND(O9*0.65/N12,2) & \" minder geboekt bij \" & N12 & \" personen omdat dit reeds als voorschot werd geboekt.\",\"\")","v":""}]
[{"$nulls":4},"Voorkeur tafelschikking:",{"$f":"'menu''s'!D127","v":"geen voorkeur"},{"$nulls":3},{"$f":"N12","v":0},"vol","x",{"$f":"IFERROR(ROUND(Q5-O9*0.175/N12,2),\"\")","v":""},{"v":0.21,"d":"21%"},{"$f":"IFERROR(J16*M16,\"\")","v":""},"Dep. A","Verwerking voorschot"]
[{"$nulls":5},{"$f":"'menu''s'!B20","v":"De gast die niet inbegrepen aperitief bestelt betaalt deze zelf (vb: sterke drank)"},{"$nulls":3},{"$f":"IFERROR( \" Er wordt € \" & ROUND(O9*0.35/N12,2) & \" minder geboekt bij \" & N12 & \" personen omdat dit reeds als voorschot werd geboekt.\",\"\")","v":""}]
[{"$f":"'menu''s'!H102","v":""},{"$nulls":7},{"$f":"IF(O9>0,\" Uw voorschot van € \" & O9 & \" wordt nog in mindering gebracht\",\"\")","v":""},{"$f":"K5-J14","v":0},{"$f":"K14","v":"vol"},"x",{"$f":"M5","v":{"v":0,"d":"0.00"}},{"$f":"N14","v":{"v":0.12,"d":"12%"}},{"$f":"J18*M18","v":{"v":0,"d":"0.00"}},"Dep. B"]
[{"$f":"'menu''s'!H103","v":""},null,{"$f":"IF(A31=\"\",\"Dit voorstel is voorlopig ongeldig, u moet nog een hoofdschotel selecteren\",\"\")","v":"Dit voorstel is voorlopig ongeldig, u moet nog een hoofdschotel selecteren"},{"$nulls":6},{"$f":"K5-J16","v":0},{"$f":"K16","v":"vol"},"x",{"$f":"Q5","v":{"v":0,"d":"0.00"}},{"v":0.21,"d":"21%"},{"v":0,"d":"0.00"},"Dep. A"]
[{"$f":"R30","v":0},null,null,{"$f":"J29","v":""},{"$nulls":5},{"$f":"K6","v":0},{"$f":"J6","v":"JR 1/2"},"x",{"$f":"M6","v":{"v":0,"d":"0.00"}},{"$f":"N14","v":{"v":0.12,"d":"12%"}},{"v":0,"d":"0.00"},"Dep. B"]
[{"$f":"R31","v":0},{"$nulls":8},{"$f":"K6","v":0},{"$f":"J6","v":"JR 1/2"},"x",{"$f":"Q6","v":{"v":0,"d":"0.00"}},{"v":0.21,"d":"21%"},{"v":0,"d":"0.00"},"Dep. A"]
[{"$f":"R32","v":0},{"$nulls":7},{"$f":"'menu''s'!K97","v":"Voorkeur achtergrondmuziek:"},{"$f":"K7","v":0},{"$f":"J7","v":"JR 1/3"},"x",{"$f":"M7","v":{"v":0,"d":"0.00"}},{"$f":"N14","v":{"v":0.12,"d":"12%"}},{"v":0,"d":"0.00"},"Dep. B"]
[{"$f":"R33","v":0},{"$nulls":7},{"$f":"'menu''s'!L97","v":"Geen voorkeur"},{"$f":"K7","v":0},{"$f":"J7","v":"JR 1/3"},"x",{"$f":"Q7","v":{"v":0,"d":"0.00"}},{"v":0.21,"d":"21%"},{"v":0,"d":"0.00"},"Dep. A"]
[{"$f":"R34","v":0},{"$nulls":7},{"$f":"VLOOKUP(I23,matrixen!A500:B523,2,FALSE)","v":0},{"$f":"IF(L24>0,\"1\",0)","v":0},{"$f":"IF(L24>0,\"x\",\"\")","v":""},{"$f":"Q9","v":{"v":0,"d":"0.00"}},{"$f":"IF(L24>0,\"21%\",\"\")","v":""},{"$f":"IF(L24>0,\"Dep. A\",\"\")","v":""},{"$f":"P9","v":""}]
[{"$f":"'menu''s'!H109","v":""},{"$nulls":9},"Totale boekwaarde:",{"$f":"SUM(O14:O23)+L24+O9+H11","v":{"v":0,"d":"0.00"}},{"$f":"IF(SUM(O14:O23)+L24+O9+H11 <>H14,\" Er is iets fout met de splitsingstabel\",\"\")","v":""}]
[{"$f":"'menu''s'!H110","v":""},{"$nulls":8},{"$f":"\"De eventuele korting contant van 2 %, in het huidig voorstel is dit € \" & ROUND(H14-H15,2) & \" is nog niet in bovenstaande splitsing verwerkt.\"","v":"De eventuele korting contant van 2 %, in het huidig voorstel is dit € 0 is nog niet in bovenstaande splitsing verwerkt."}]
[{"$f":"'menu''s'!H111","v":""}]
[{"$f":"'menu''s'!H112","v":""},{"$nulls":8},{"$f":"IF(N28<>\"\",\"Detail van het aperitief:\",\"\")","v":""},{"$nulls":3},{"$f":"A18","v":""}]
[{"$f":"'menu''s'!H113","v":""},{"$nulls":8},{"$f":"'menu''s'!G24","v":""}]
[{"$f":"'menu''s'!H114","v":""},{"$nulls":8},{"$f":"'menu''s'!G13","v":0},{"$nulls":7},{"$f":"'menu''s'!F13","v":0}]
{"$rows_left_out":20}