{"text_format":"3","workbook":"xlsx","n_sheets":4,"sheets":["recepties en babyborrels","matrixen","Algemene verkoopsvoorwaarden","Reservatievoorstel"],"not_rendered":{"macros":1,"defined_names":3},"read":"whole","date_system":"1900"}

{"sheet":"recepties en babyborrels","index":0,"n_rows":173,"n_cols":27,"rows_kept":173,"merged":[[14,5,14,6],[22,5,22,8],[23,5,23,8],[24,5,24,8],[25,5,25,8],[26,5,26,8],[30,1,31,1],[30,5,40,5],[48,7,48,10],[63,10,63,21]]}
[null,"Deze info is van: Feestzaal Katelijnenhof, Heirweg 172, 8800 Roeselare. Contacteer de zaakvoerder: 0475/618058 - info@katelijnenhof.be - web: www.katelijnenhof.be met foto's en volledige prijslijst.",{"$nulls":9},{"$f":"TODAY()","v":"2019-10-31"}]
[]
[null,{"$f":"\"Rekenmodule recepties en babyborrels. De prijzen in deze module gelden voor alle personen die een receptie nemen die niet gevolgd wordt door een maaltijd. Geldig  tot \" & DAY(matrixen!B1) & \" - \" & MONTH(matrixen!B1) & \" - \" & YEAR(matrixen!B1)","v":"Rekenmodule recepties en babyborrels. De prijzen in deze module gelden voor alle personen die een receptie nemen die niet gevolgd wordt door een maaltijd. Geldig  tot 31 - 12 - 2019"}]
[]
[{"$nulls":5},"kinderen",null,"kinderen",null,"kinderen"]
[{"$nulls":3},{"$f":"IF(TODAY()>AA11,\"Deze module is niet meer geldig.\",\"\")","v":""},null," 0 t.e.m. 2 j. 11 maand",null,"3 j. t.e.m. 5 j. 11 maand",null,"6 j, t.e.m. 11 jr. 11 maand"]
[null,"Totaal per volwassene:",null,{"$f":"IF(TODAY()>AA11,1/0,SUM(D12:D59))","v":{"v":0,"d":"0.00"}},null,"0,00",null,{"$f":"ROUND(D7/3,2)","v":{"v":0,"d":"0.00"}},null,{"$f":"ROUND(D7/2,2)","v":{"v":0,"d":"0.00"}}]
[]
[null,"MAAK UW KEUZE in de gele vakken:",null,{"$f":"IF(D13>0,\"U koos nog geen receptieformule\",0)","v":0}]
[null,"(klik op de gele balk, vervolgens op het pijltje rechts en scroll ev. naar beneden)",null,"prijs pp",null,"Beknopte info",{"$nulls":3},"Gedetailleerde info"]
[null,"Kies hier eerst uw soort receptie. ",{"$nulls":24},{"$f":"matrixen!B1","v":"2019-12-31"}]
[null,"Maak in dit vak uw keuze",null,{"$f":"VLOOKUP(B12,matrixen!B13:I23,8,FALSE)","v":0},null,{"$f":"IFERROR(HLOOKUP($B$12,matrixen!$K$14:$V$22,2,FALSE),\"<= U moet eerst een receptieformule kiezen\")","v":0},{"$nulls":3},{"$f":"HLOOKUP($B$12,matrixen!$W$14:$AH$465,2,FALSE)","v":0},{"$nulls":16},{"$f":"matrixen!B13","v":"Maak in dit vak uw keuze"}]
[null,"Maak in dit vak uw keuze",{"$nulls":3},{"$f":"HLOOKUP($B$12,matrixen!$K$14:$V$22,3,FALSE)","v":0},{"$nulls":3},{"$f":"HLOOKUP($B$12,matrixen!$W$14:$AH$465,3,FALSE)","v":0},{"$nulls":16},{"$f":"matrixen!B14","v":"Babyborrel"}]
[null,{"$f":"IF(F12=\"U moet een receptieformule kiezen\", \"Kies hierboven een receptieformule!!\",\"\")","v":""},null,{"$f":"IF(OR(B12=\"\",D12=0),0,IF(AND(OR(B12=matrixen!B14,B12 = matrixen!B15),YEAR(F48)=2018),-2,0))","v":0},null,{"$f":"HLOOKUP($B$12,matrixen!$K$14:$V$22,4,FALSE)","v":0},{"$nulls":3},{"$f":"HLOOKUP($B$12,matrixen!$W$14:$AH$465,4,FALSE)","v":0},{"$nulls":16},{"$f":"matrixen!B15","v":"Partyformule"}]
[null,"Indien een genodigde een extra aperitief bestelt of een aperitief wenst die niet in de prijs begrepen is dan:",{"$nulls":3},{"$f":"HLOOKUP($B$12,matrixen!$K$14:$V$22,5,FALSE)","v":0},{"$nulls":3},{"$f":"HLOOKUP($B$12,matrixen!$W$14:$AH$465,5,FALSE)","v":0},{"$nulls":16},{"$f":"matrixen!B16","v":"Receptie E"}]
[null,"De gast die een extra aperitief bestelt betaalt deze zelf",{"$nulls":3},{"$f":"HLOOKUP($B$12,matrixen!$K$14:$V$22,6,FALSE)","v":0},{"$nulls":3},{"$f":"HLOOKUP($B$12,matrixen!$W$14:$AH$465,6,FALSE)","v":0},{"$nulls":16},{"$f":"matrixen!B17","v":"Receptie A"}]
[null,"De gast die een extra aperitief bestelt betaalt deze zelf",{"$nulls":3},{"$f":"HLOOKUP($B$12,matrixen!$K$14:$V$22,7,FALSE)","v":0},{"$nulls":3},{"$f":"HLOOKUP($B$12,matrixen!$W$14:$AH$465,7,FALSE)","v":0},{"$nulls":16},{"$f":"matrixen!B18","v":"Uitgebreide receptie, alle doelen"}]
[null,"Alle extra aperitief komt op de algemene rekening.",{"$nulls":3},{"$f":"HLOOKUP($B$12,matrixen!$K$14:$V$22,8,FALSE)","v":0},{"$nulls":3},{"$f":"HLOOKUP($B$12,matrixen!$W$14:$AH$465,8,FALSE)","v":0},{"$nulls":16},{"$f":"matrixen!B19","v":"Free-flow 1 maaltijd-receptieformule met buffetjes en warme hapjes"}]
[null,"Mogelijke supplementen drank",{"$nulls":3},{"$f":"HLOOKUP($B$12,matrixen!$K$14:$V$22,9,FALSE)","v":0},{"$nulls":3},{"$f":"HLOOKUP($B$12,matrixen!$W$14:$AH$465,9,FALSE)","v":0},{"$nulls":16},{"$f":"matrixen!B20","v":"Free-flow 1 maaltijd-receptieformule met buffetjes en warme hapjes en extra gerookte zalm en krabsalade"}]
[{"$nulls":9},{"$f":"HLOOKUP($B$12,matrixen!$W$14:$AH$465,10,FALSE)","v":0},{"$nulls":16},{"$f":"matrixen!B21","v":0}]
{"$rows_left_out":104}
{"sheet":"matrixen","index":1,"n_rows":383,"n_cols":34,"rows_kept":383,"hidden":true}
[null,"2019-12-31",{"$nulls":9},"lam, zwanen enz..  . Met foto suppl.",{"$nulls":3},{"v":15,"d":"15.00"},{"$nulls":16},"Buffetje no 1: "]
[{"$nulls":11},"Foto op de taart: suppl. € ",null,null,{"v":0.7,"d":"0.70"},"per stuk taart en € ",null,{"v":10,"d":"10.00"}," per foto",{"$nulls":13},"Mini broodjes","Chaumes"]
[{"$nulls":33},"Belegen hoevekaas (vb  Oud Brugge)"]
[{"$nulls":33},"Brie"]
[]
[]
[null,"Minimaal verbruik feest",null,null,950]
[]
[]
[]
[]
[]
[null,"Maak in dit vak uw keuze",{"$nulls":6},0]
[null,"Babyborrel",{"$nulls":6},{"v":27,"d":"€ 27.00"},null,"Maak in dit vak uw keuze","Babyborrel","Partyformule","Receptie E","Uitgebreide receptie, alle doelen",null,null,"Receptie A","Free-flow 1 maaltijd-receptieformule met buffetjes en warme hapjes","Free-flow 1 maaltijd-receptieformule met buffetjes en warme hapjes en extra gerookte zalm en krabsalade","Free-flow 2 maaltijd-receptieformule met buffetjes en warme hapjes","Free-flow 2 maaltijd-receptieformule met buffetjes en warme hapjes en extra gerookte zalm en krabsalade","Maak in dit vak uw keuze","Babyborrel","Partyformule","Receptie E","Uitgebreide receptie, alle doelen",0,0,"Receptie A","Free-flow 1 maaltijd-receptieformule met buffetjes en warme hapjes","Free-flow 1 maaltijd-receptieformule met buffetjes en warme hapjes en extra gerookte zalm en krabsalade","Free-flow 2 maaltijd-receptieformule met buffetjes en warme hapjes","Free-flow 2 maaltijd-receptieformule met buffetjes en warme hapjes en extra gerookte zalm en krabsalade"]
[null,"Partyformule",{"$nulls":6},{"v":27,"d":"€ 27.00"},null,null,"Onze meest uitgebreide ","Uitgebreide receptie ","Kleinere receptie","Onze meest uitgebreide ",null,null,"Basis receptie.","All-in maaltijd - receptieformule ","All-in maaltijd - receptieformule ","All-in maaltijd - receptieformule ","All-in maaltijd - receptieformule ",null,"dranken inbegrepen gedurende 3 uur","dranken inbegrepen gedurende 3 uur","dranken inbegrepen","dranken inbegrepen gedurende 3 uur",0,0,"dranken inbegrepen","Met deze formule hebben uw gasten ook een maaltijd genomen.","Met deze formule hebben uw gasten ook een maaltijd genomen.","Met deze formule hebben uw gasten ook een maaltijd genomen.","Met deze formule hebben uw gasten ook een maaltijd genomen."]
[null,"Receptie E",{"$nulls":6},{"v":18.1,"d":"€ 18.10"},null,null,"receptie met een overvloed aan","met 9 hapjes","met een 4 aperitiefglaasjes als","receptie met een overvloed aan",null,null,"Dranken 2 uur inbegrepen.","van maximaal 3u30 ","van maximaal 3u30 ","van maximaal 3u30 ","van maximaal 3u30 ",null,"met schuimwijn van het huis en alle frisdranken en bieren naar believen, ","met schuimwijn van het huis en alle frisdranken en bieren naar believen, ","gedurende 2 uur","met schuimwijn van het huis en alle frisdranken en bieren naar believen, ",0,0,"gedurende 2 uur","All-in maaltijd - receptieformule van maximaal 3u30 ","All-in maaltijd - receptieformule van maximaal 3u30 ","All-in maaltijd - receptieformule van maximaal 3u30 ","All-in maaltijd - receptieformule van maximaal 3u30 "]
[null,"Receptie A",{"$nulls":6},{"v":15.5,"d":"€ 15.50"},null,null,"hapjes en drank gedurende 3 uur.","en doorlopend drank.","hapje en drank gedurende 2 uur.","hapjes en drank gedurende 3 uur.",null,null,"Goed voor een maaltijd.","De gasten hebben volledig","De gasten hebben volledig","De gasten hebben volledig","De gasten hebben volledig",null,"uitgebreide fomule met hapjes in menuvorm (max 3uur)","uitgebreide fomule met hapjes in menuvorm (max 3uur)","met huis schuimwijn,","uitgebreide fomule met hapjes in menuvorm (max 3uur)",0,0,"met huis schuimwijn,","Verbruik daarbuiten wordt extra gerekend","Verbruik daarbuiten wordt extra gerekend","Verbruik daarbuiten wordt extra gerekend","Verbruik daarbuiten wordt extra gerekend"]
[null,"Uitgebreide receptie, alle doelen",{"$nulls":6},{"v":27,"d":"€ 27.00"},null,null,"Kiest u voor een BABYNOCTURNE","Kies ook 1 warm gerecht,","Kan als babyborrel, indien","Kan op veel manieren",null,null,"Kan voor andere doelen ev.","gegeten na deze formule.","gegeten na deze formule.","gegeten na deze formule.","gegeten na deze formule.",null,"“3 koude voorgerechtjes\", u kiest uit: * verse oester ","“3 koude voorgerechtjes\", u kiest uit: * verse oester ","frisdranken en","“3 koude voorgerechtjes\", u kiest uit: * verse oester ",0,0,"frisdranken en","gedurende 2 uur","gedurende 2 uur","met Schuimwijn van het huis en alle frisdranken en bieren naar believen, ","met Schuimwijn van het huis en alle frisdranken en bieren naar believen, "]
[null,"Free-flow 1 maaltijd-receptieformule met buffetjes en warme hapjes",{"$nulls":6},{"v":33,"d":"€ 33.00"},null,null,"op een vrijdag bvb van 18 tot 21u","al dan niet met friet","aangevuld met andere hapjes","uitgebreid worden.",null,null,"aangevuld worden met ","De klemtoon ligt op een","De klemtoon ligt op een","De klemtoon ligt op een","De klemtoon ligt op een",null,"* eendenmousse met rode bessen en koornbloemblaadjes","* eendenmousse met rode bessen en koornbloemblaadjes","bieren naar believen.","* eendenmousse met rode bessen en koornbloemblaadjes",0,0,"bieren naar believen.","Er wordt rondgekomen met 5 warme hapjes per persoon","Er wordt rondgekomen met 5 warme hapjes per persoon","Er wordt rondgekomen met 5 warme hapjes per persoon","Er wordt rondgekomen met 5 warme hapjes per persoon"]
[null,"Free-flow 1 maaltijd-receptieformule met buffetjes en warme hapjes en extra gerookte zalm en krabsalade",{"$nulls":6},{"v":36,"d":"€ 36.00"},null,null,"Dan krijgt u een gratis fotoshoot voor de baby!","En selecteer forfait drank!","(In totaal minstens 7 hapjes!)",{"$nulls":3},"belegde broodjes.","kaasbuffet aangevuld","kaasbuffet aangevuld","vleesbuffet aangevuld","vleesbuffet aangevuld",null,"* mousse van krab met rode bietscheutjes","* mousse van krab met rode bietscheutjes",0,"* mousse van krab met rode bietscheutjes",0,0,0,"Op de tafels:","Op de tafels:","Op de tafels:","Op de tafels:"]
{"$rows_left_out":107}
{"sheet":"Algemene verkoopsvoorwaarden","index":2,"n_rows":63,"n_cols":13,"rows_kept":63}
[null,"Algemene verkoopsvoorwaarden:"]
[null,"1) Onze facturen zijn contant te betalen bij levering van de goederen. Bijgevolg zal in geval van laattijdige betaling"]
[null,"van rechtswege en zonder voorafgaande ingebrekestelling een intrest aangerekend worden van 12% per jaar op de "]
[null,"bedragen, verschuldigd acht dagen na de vervaldag van de facturen. Tevens zal bij gebrek aan betaling na "]
[null,"aanmaning bij gewone brief, het verschuldigde bedrag van rechtswege verhoogd worden met een forfaitaire"]
[null,"vergoeding van 12 % met een minimum van € 50  voor bijkomende administratieve kosten, debiteurenbewaking "]
[null,"en commerciële stoornissen. Wij behouden ons het recht voor op elk moment de leveringen te staken. Elke "]
[null,"klacht over de kwaliteit van de geleverde goederen moet uiterlijk 24 uur na de levering worden overgemaakt. "]
[null,"Klachten in verband met facturatie kunnen slechts in aanmerking worden genomen zo zij binnen de acht "]
[null,"dagen na ontvangst van de goederen bij aangetekende brief worden meegedeeld. In geval van betwisting zijn "]
[null,"uitsluitend de rechtbanken van Kortrijk bevoegd. De leveringen  geschieden op risico van de bestemmeling. Er "]
[null,"wordt uitdrukkelijk overeengekomen dat de klant door het plaatsen van een bestelling onze algemene "]
[null,"verkoopsvoorwaarden erkent. Elke wijziging hieraan moet voorafgaandelijk in een schriftelijk akkoord worden "]
[null,"vastgelegd."]
[]
[null,"2) Annulatie dient schriftelijk en gedateerd te geschieden. "]
[null,"In geval van annulatie minder dan 60 dagen voor de activiteit blijft het voorschot eigendom van het Katelijnenhof."]
[null,"Voor annulatie minder dan 10 dagen voor de activiteit is de klant in alle gevallen verplicht 35 % van de reservatie-"]
[null,"waarde van de gehele manifestatie te vergoeden."]
[null,"Bij annulatie minder dan 5 dagen voor  de activiteit is de klant in alle gevallen verplicht de reservatie waarde van de "]
{"$rows_left_out":44}
{"sheet":"Reservatievoorstel","index":3,"n_rows":62,"n_cols":18,"rows_kept":62,"merged":[[2,14,3,14],[2,15,3,15],[2,16,3,16],[2,17,3,17],[9,12,9,13],[12,9,12,11],[12,12,12,16],[14,9,14,17],[16,9,16,17],[23,14,23,17],[25,9,26,17],[34,0,35,8],[36,0,40,8]]}
[null,null,"Reservatievoorstel",{"$nulls":7},"Uitsplitsing per BTW tarief.",{"$nulls":4},"Totaalprijs per vol:",{"$f":"E9","v":{"v":0,"d":"0.00"}}]
["Naam Klant:",null,{"$f":"'recepties en babyborrels'!F58","v":0},{"$nulls":3},"Katelijnenhof",{"$nulls":8},{"$f":"IF(Q2>0,\"Prijs drankforfait na de maaltijd, volledig aan 21% BTW:\",\"\")","v":""},{"$f":"'recepties en babyborrels'!D33","v":{"v":0,"d":"0.00"}}]
["Adres:",null,{"$f":"'recepties en babyborrels'!F59","v":0},{"$nulls":3},"Heirweg 172",{"$nulls":5},"Menu",null,"Dep. B",{"$f":"IF(Q2>0,\"Drank- forfait:\",\"\")","v":""},"Totaal aan 21%","Dep. A"]
["Stad:",null,{"$f":"'recepties en babyborrels'!F60","v":0},{"$nulls":3},"8800 Roeselare",{"$nulls":3},"aantal","totaal:","deel 12%","deel21%"]
["Tel nr:",null,{"$f":"'recepties en babyborrels'!F61","v":0},{"$nulls":3},"info@katelijnenhof.be",null,null,"Vol",{"$f":"D9","v":0},{"$f":"Q1-Q2","v":{"v":0,"d":"0.00"}},{"$f":"ROUND(L5*0.65,2)","v":{"v":0,"d":"0.00"}},{"$f":"L5-M5","v":{"v":0,"d":"0.00"}},{"$f":"K5*M5","v":{"v":0,"d":"0.00"}},{"$f":"Q2","v":{"v":0,"d":"0.00"}},{"$f":"N5+P5","v":{"v":0,"d":"0.00"}},{"$f":"K5*Q5","v":{"v":0,"d":"0.00"}}]
[{"$f":"'recepties en babyborrels'!E65","v":"reden feest:"},{"$f":"'recepties en babyborrels'!F65","v":0},{"$nulls":4},"Gsm 0475/618058",null,null,"JR 1/2",{"$f":"D10","v":0},{"$f":"E10-P6","v":{"v":0,"d":"0.00"}},{"$f":"ROUND(L6*0.65,2)","v":{"v":0,"d":"0.00"}},{"$f":"L6-M6","v":{"v":0,"d":"0.00"}},{"$f":"K6*M6","v":{"v":0,"d":"0.00"}},{"$f":"ROUND(Q2/2,2)","v":{"v":0,"d":"0.00"}},{"$f":"N6+P6","v":{"v":0,"d":"0.00"}},{"$f":"K6*Q6","v":{"v":0,"d":"0.00"}}]
["Datum activiteit:",null,{"$f":"'recepties en babyborrels'!F48","v":"00:00:00"},null,"email klant:",{"$f":"'recepties en babyborrels'!F62","v":0},{"$nulls":3},"JR 1/3",{"$f":"D11","v":0},{"$f":"E11-P7","v":{"v":0,"d":"0.00"}},{"$f":"ROUND(L7*0.65,2)","v":{"v":0,"d":"0.00"}},{"v":0,"d":"0.00"},{"v":0,"d":"0.00"},{"$f":"ROUND(Q2/3,2)","v":{"v":0,"d":"0.00"}},{"$f":"N7+P7","v":{"v":0,"d":"0.00"}},{"v":0,"d":"0.00"}]
["Totaal aantal personen:",null,null,{"$f":"D9+D12+D11+D10","v":0},"prijs:",null,"aankomst om:",{"$f":"'recepties en babyborrels'!F55","v":0},null,"JR gratis",{"$f":"D12","v":0},{"$f":"E12","v":"0,00"},{"$f":"ROUND(L8*0.65,2)","v":0},{"v":0,"d":"0.00"},{"v":0,"d":"0.00"},null,{"$f":"N8+P8","v":0},{"v":0,"d":"0.00"}]
[null,null,"volwassenen:",{"$f":"'recepties en babyborrels'!F50","v":0},{"$f":"'recepties en babyborrels'!D7","v":{"v":0,"d":"0.00"}},null,"aan tafel om:",{"$f":"'recepties en babyborrels'!F56","v":0},{"$nulls":3},"Voorschot reeds betaald:",null,null,{"$f":"ROUND(M9/98*100,2)","v":0},{"$f":"IF(Q9>0,\"Huur zaal/exclusiviteit\",\"\")","v":""},{"$f":"I12+I13","v":{"v":0,"d":"0.00"}}]
[null,null,"JR 1/2 (6 t.e.m. 11) :",{"$f":"'recepties en babyborrels'!F51","v":0},{"$f":"'recepties en babyborrels'!J7","v":{"v":0,"d":"0.00"}},null,null,"raming totaal 1:",{"$f":"D9*E9+D10*E10+D11*E11+D12*E12","v":{"v":0,"d":"€ 0.00"}},null,null,"Gestort / betaald op:"]
[null,null,"JR 1/3 (3 t.e.m. 5) :",{"$f":"'recepties en babyborrels'!F52","v":0},{"$f":"'recepties en babyborrels'!H7","v":{"v":0,"d":"0.00"}},null,null,"ander rekenblad:",{"$f":"'recepties en babyborrels'!F63","v":{"v":0,"d":"€ 0.00"}},null,null,{"$f":"IF(O9>0,\"Voorschot uitgesplitst:\",\"\")","v":""},{"$f":"IF(O9>0,\" € \"&ROUND(O9*0.65,2) & \" x 12% => Dep. B  en € \" & ROUND(O9*0.35,2) & \" x 21% => Dep. A.\",\"\")","v":""}]
[null,null,"JR gratis (0 t.e.m. 2) :",{"$f":"'recepties en babyborrels'!F53","v":0},{"$f":"'recepties en babyborrels'!F7","v":"0,00"},null,null,"huur zaal:",{"$f":"IF(D8=0,0,IF((I10+I11)<'Algemene verkoopsvoorwaarden'!J44,('Algemene verkoopsvoorwaarden'!J44-Reservatievoorstel!I10-Reservatievoorstel!I11),0))","v":{"v":0,"d":"€ 0.00"}},{"$nulls":3},"Voorschot wordt gesplitst over:",{"$f":"IF(O9>0,ROUNDUP((O9+1)/L5,0),0)","v":0}," volwassenen"]
[{"$nulls":7},{"$f":"IF('recepties en babyborrels'!E47>0,\"U koos exclusiviteit: \",\"\")","v":""},{"$f":"'recepties en babyborrels'!E47","v":{"v":0,"d":"€ 0.00"}},"Input GKS:",null,null,{"$f":"IF(O9*0.65 >N12*M5,\"ONMOGELIJK U bekomt negatieve waarden.\",\"\")","v":""}]
[{"$nulls":7},"raming algemeen totaal:",{"$f":"I12+I11+I10+I13","v":{"v":0,"d":"€ 0.00"}},{"$f":"N12","v":0},"vol","x",{"$f":"IFERROR(ROUND(M5-O9*0.65/N12,2),\"\")","v":""},{"v":0.12,"d":"12%"},{"$f":"IFERROR(J14*M14,\"\")","v":""},"Dep. B","Verwerking voorschot"]
[{"$nulls":7},"raming te betalen indien contante betaling  (max € 3000 cash):",{"$f":"'recepties en babyborrels'!F72","v":{"v":0,"d":"€ 0.00"}},{"$f":"IFERROR( \" Er wordt € \" & ROUND(O9*0.65/N12,2) & \" minder geboekt bij \" & N12 & \" personen omdat dit reeds als voorschot werd geboekt.\",\"\")","v":""}]
[{"$nulls":8},{"$f":"IF(O9>0,\" Uw voorschot van € \" & O9 & \" wordt nog in mindering gebracht\",\"\")","v":""},{"$f":"N12","v":0},"vol","x",{"$f":"IFERROR(ROUND(Q5-O9*0.35/N12,2),\"\")","v":""},{"v":0.21,"d":"21%"},{"$f":"IFERROR(J16*M16,\"\")","v":""},"Dep. A","Verwerking voorschot"]
[{"$f":"IFERROR(E9,\"Dit voorstel is ongeldig. Het aantal hapjes klopt niet\")","v":0},{"$nulls":6},"Voorziene tafelschikking:",null,{"$f":"IFERROR( \" Er wordt € \" & ROUND(O9*0.35/N12,2) & \" minder geboekt bij \" & N12 & \" personen omdat dit reeds als voorschot werd geboekt.\",\"\")","v":""}]
[{"$nulls":8},"informele opstelling",{"$f":"K5-J14","v":0},{"$f":"K14","v":"vol"},"x",{"$f":"M5","v":{"v":0,"d":"0.00"}},{"v":0.12,"d":"12%"},{"$f":"J18*M18","v":{"v":0,"d":"0.00"}},"Dep. B"]
[{"$nulls":8},"U kunt dit wijzigen, maar neem daarvoor contact met ons op.",{"$f":"K5-J16","v":0},{"$f":"K16","v":"vol"},"x",{"$f":"Q5","v":{"v":0,"d":"0.00"}},{"v":0.21,"d":"21%"},{"v":0,"d":"0.00"},"Dep. A"]
[{"$f":"'recepties en babyborrels'!H49","v":0},{"$nulls":8},{"$f":"K6","v":0},{"$f":"J6","v":"JR 1/2"},"x",{"$f":"M6","v":{"v":0,"d":"0.00"}},{"v":0.12,"d":"12%"},{"v":0,"d":"0.00"},"Dep. B"]
{"$rows_left_out":32}