{"text_format":"1","workbook":"xlsx","n_sheets":4,"sheets":["walking dinner","matrixen","Algemene verkoopsvoorwaarden","Reservatievoorstel"],"not_rendered":{"charts":0,"images":0,"macros":1,"external_links":0,"defined_names":2,"comments":0,"pivot_tables":0},"unopened":[],"bounds":{"document_bytes":16777216,"sheet_cells":100000,"rows_first":2000,"rows_last":500,"rows_between":2000,"halvings":0,"cell_chars":16384,"cell_head_chars":4096},"cells_cut":0,"cells_raw":0,"read":"whole","date_system":"1900"}

{"sheet":"walking dinner","index":0,"n_rows":143,"n_cols":33,"rows_kept":143,"cut":false,"hidden":false,"merged":[[99,10,99,14],[101,10,101,14],[100,10,100,14],[102,10,102,17]]}
[null,"Deze info is van: Feestzaal Katelijnenhof, Heirweg 172, 8800 Roeselare. Contacteer de zaakvoerder: 0475/618058 - info@katelijnenhof.be - web: www.katelijnenhof.be met foto's en volledige prijslijst."]
[]
[null,{"$f":"\"Rekenmodule walking dinner. De prijzen van de recepties in deze module gelden voor alle personen waarvan de receptie gevolgd wordt door een maaltijd. Geldig  tot \" & DAY(matrixen!B1) & \" - \" & MONTH(matrixen!B1) & \" - \" & YEAR(matrixen!B1)","v":"Rekenmodule walking dinner. De prijzen van de recepties in deze module gelden voor alle personen waarvan de receptie gevolgd wordt door een maaltijd. Geldig  tot 23 - 2 - 2018"}]
[]
[null,"4 Buffetten / Dranken gedurende 5 uur inbegrepen.",null,null,null,"kinderen",null,"kinderen",null,"kinderen"]
[null,null,null,{"$f":"IF(TODAY()>AA11,\"Deze module is niet meer geldig.\",\"\")","v":""},null," 0 t.e.m. 2 j. 11 maand",null,"3 j. t.e.m. 5 j. 11 maand",null,"6 j, t.e.m. 11 jr. 11 maand"]
[null,"Totaal per volwassene:",null,{"$f":"IF(TODAY()>AA11,1/0,SUM(D10:D1010))","v":47.8},null,"0,00",null,{"$f":"D7/3","v":15.933333333333332},null,{"$f":"D7/2","v":23.9}]
[null,null,null,null,null,"U kan ook voor de kinderen een kindermenu nemen ( zie een andere rekenmodule)"]
[]
[null,"MAAK STEEDS UW KEUZE in de gele vakken: (scroll naar beneden om meer gegevens in te vullen) Hierboven kunt u uw prijs volgen.",null,null,null,null,null,null,"U vindt verder een overzicht van uw selectie"]
[null,"(klik op de gele balk, vervolgens op het pijltje rechts en scroll ev. naar beneden)",null,"prijs pp",null,"Beknopte info",null,"Gedetailleerde info",null,null,null,null,null,null,null,null,null,null,null,null,null,null,null,null,null,null,{"$f":"matrixen!B1","v":"2018-02-23"}]
[]
[null,null,null,null,null,{"$f":"HLOOKUP($B$16,matrixen!$K$14:$S$18,2,FALSE)","v":0},null,{"$f":"HLOOKUP($B$16,matrixen!$T$14:$AB$28,2,FALSE)","v":0}]
[null,null,null,null,null,{"$f":"HLOOKUP($B$16,matrixen!$K$14:$S$18,3,FALSE)","v":0},null,{"$f":"HLOOKUP($B$16,matrixen!$T$14:$AB$28,3,FALSE)","v":0},null,null,null,null,null,null,null,null,null,null,null,null,null,null,null,null,null,null,{"$f":"matrixen!B11","v":"Maak in dit vak uw keuze voor het aperitief"}]
[null,null,null,null,null,{"$f":"HLOOKUP($B$16,matrixen!$K$14:$S$18,4,FALSE)","v":0},null,{"$f":"HLOOKUP($B$16,matrixen!$T$14:$AB$28,4,FALSE)","v":0},null,null,null,null,null,null,null,null,null,null,null,null,null,null,null,null,null,null,{"$f":"matrixen!B14","v":"Receptie F"}]
[null,"Maak in dit vak uw keuze voor het aperitief",null,{"$f":"IF(B16=matrixen!B11,0,VLOOKUP(B16,matrixen!B12:I19,8,FALSE)-matrixen!I19)","v":0},null,{"$f":"HLOOKUP($B$16,matrixen!$K$14:$S$19,5,FALSE)","v":0},null,{"$f":"HLOOKUP($B$16,matrixen!$T$14:$AB$28,5,FALSE)","v":0},null,null,null,null,null,null,null,null,null,null,null,null,null,null,null,null,null,null,{"$f":"matrixen!B15","v":"Receptie E"}]
[null,"Maak in dit vak uw keuze voor het aperitief",null,null,null,null,null,{"$f":"HLOOKUP($B$16,matrixen!$T$14:$AB$28,6,FALSE)","v":0},null,null,null,null,null,null,null,null,null,null,null,null,null,null,null,null,null,null,{"$f":"matrixen!B16","v":"Receptie D"}]
[null,null,null,null,null,null,null,{"$f":"HLOOKUP($B$16,matrixen!$T$14:$AB$28,7,FALSE)","v":0},null,null,null,null,null,null,null,null,null,null,null,null,null,null,null,null,null,null,{"$f":"matrixen!B17","v":"Receptie C"}]
[null,null,null,null,null,null,null,{"$f":"HLOOKUP($B$16,matrixen!$T$14:$AB$28,8,FALSE)","v":0},null,null,null,null,null,null,null,null,null,null,null,null,null,null,null,null,null,null,{"$f":"matrixen!B18","v":"Receptie B"}]
[null,null,null,null,null,null,null,{"$f":"HLOOKUP($B$16,matrixen!$T$14:$AB$28,9,FALSE)","v":0},null,null,null,null,null,null,null,null,null,null,null,null,null,null,null,null,null,null,{"$f":"matrixen!B19","v":"Receptie A"}]
[null,"Indien een genodigde een extra aperitief bestelt of een aperitief wenst die niet in de prijs begrepen is dan:",null,null,null,null,null,{"$f":"HLOOKUP($B$16,matrixen!$T$14:$AB$28,10,FALSE)","v":0}]
[null,"De gast die een extra aperitief bestelt betaalt deze zelf",null,null,null,"De gast die een extra aperitief bestelt betaalt deze zelf",null,{"$f":"HLOOKUP($B$16,matrixen!$T$14:$AB$28,11,FALSE)","v":0}]
[null,"De gast die een extra aperitief bestelt betaalt deze zelf",null,null,null,"Alle extra aperitief komt op de algemene rekening.",null,{"$f":"HLOOKUP($B$16,matrixen!$T$14:$AB$28,12,FALSE)","v":0},null,null,null,null,null,null,null,null,null,null,null,null,null,null,null,null,null,null,{"$f":"matrixen!B20","v":0}]
[null,null,null,null,null,null,null,{"$f":"HLOOKUP($B$16,matrixen!$T$14:$AB$28,13,FALSE)","v":0},null,null,null,null,null,null,null,null,null,null,null,null,null,null,null,null,null,null,{"$f":"matrixen!A193","v":"Kies hier uw soepen"}]
[null,null,null,null,null,null,null,{"$f":"HLOOKUP($B$16,matrixen!$T$14:$AB$28,14,FALSE)","v":0},null,null,null,null,null,null,null,null,null,null,null,null,null,null,null,null,null,null,{"$f":"matrixen!A194","v":"Schaaldierenroomsoep"}]
[null,null,null,null,null,null,null,{"$f":"HLOOKUP($B$16,matrixen!$T$14:$AB$28,15,FALSE)","v":0},null,null,null,null,null,null,null,null,null,null,null,null,null,null,null,null,null,null,{"$f":"matrixen!A195","v":"Noordzeeketeltje"}]
[null,null,null,null,null,null,null,null,null,null,null,null,null,null,null,null,null,null,null,null,null,null,null,null,null,null,{"$f":"matrixen!A196","v":"Romig groentesoepje , geparfumeerd met gerookte kipperfilets"}]
[null,"Eerste buffet = 2 soorten soep",null,null,null,null,null,null,null,null,null,null,null,null,null,null,null,null,null,null,null,null,null,null,null,null,{"$f":"matrixen!A197","v":"Ossenstaartsoep met verse stukjes ossenstaart"}]
[null,"* betekent geschikt voor vegetariers. ",null,null,null,null,null,null,null,null,null,null,null,null,null,null,null,null,null,null,null,null,null,null,null,null,{"$f":"matrixen!A198","v":"Komkommerroomsoep *"},null,null,null,null,null,{"$f":"matrixen!A212","v":0}]
[null,null,null,null,null,null,null,null,null,null,null,null,null,null,null,null,null,null,null,null,null,null,null,null,null,null,{"$f":"matrixen!A199","v":"Aspergeroomsoep met koornbloemblaadjes *"},null,null,null,null,null,{"$f":"matrixen!A213","v":0}]
{"$rows_left_out":114}
{"sheet":"matrixen","index":1,"n_rows":382,"n_cols":28,"rows_kept":382,"cut":false,"hidden":true,"merged":[]}
[null,"2018-02-23",null,null,null,null,null,null,null,null,null,"lam, zwanen enz..  . Met foto suppl.",null,null,null,15]
[null,null,null,null,null,null,null,null,null,null,null,"Foto op de taart: suppl. € ",null,null,0.7,"per stuk taart en € ",null,10," per foto"]
[]
[]
[]
[null,"Minimaal verbruik feest",null,null,950]
[]
[]
[]
[]
[null,"Maak in dit vak uw keuze voor het aperitief",null,null,null,null,null,null,10]
[null,"1 aperitief per persoon",null,null,null,null,null,null,6]
[null,"2 aperitieven per persoon",null,null,null,null,null,null,10]
[null,"Receptie F",null,null,null,null,null,null,15.5,null,"Maak in dit vak uw keuze voor het aperitief","1 aperitief per persoon","2 aperitieven per persoon","Receptie F","Receptie E","Receptie D","Receptie C","Receptie B","Receptie A","Maak in dit vak uw keuze voor het aperitief","1 aperitief per persoon","2 aperitieven per persoon","Receptie F","Receptie E","Receptie D","Receptie C","Receptie B","Receptie A"]
[null,"Receptie E",null,null,null,null,null,null,12.600000000000001,null,null,"1 per persoon,  ","2 per persoon,  ","Zeer uitgebreide receptie","Uitgebreide receptie","Basis receptie.","Zeer uitgebreide receptie","Uitgebreide receptie","Basis receptie.",null,"vrije keuze","vrije keuze","dranken inbegrepen gedurende 2 uur","dranken inbegrepen gedurende 2 uur","dranken inbegrepen gedurende 2 uur","dranken inbegrepen gedurende 2 uur","dranken inbegrepen gedurende 2 uur","dranken inbegrepen gedurende 2 uur"]
[null,"Receptie D",null,null,null,null,null,null,11.100000000000001,null,null,"eventueel tweede wordt","eventueel derde wordt","met 4 aperitiefglaasjes,","met 4 aperitiefglaasjes","Dranken 2 uur inbegrepen.","met 3 koude toastjes en 3 warme ","met 3 koude toastjes en 3 warme ","Dranken 2 uur inbegrepen.",null,"Porto rood","Porto rood","met Schuimwijn van het huis en alle frisdranken en bieren naar believen, ","met Schuimwijn van het huis en alle frisdranken en bieren naar believen, ","met Schuimwijn van het huis en alle frisdranken en bieren naar believen, ","met Schuimwijn van het huis en alle frisdranken en bieren naar believen, ","met Schuimwijn van het huis en alle frisdranken en bieren naar believen, ","met Schuimwijn van het huis en alle frisdranken en bieren naar believen, "]
[null,"Receptie C",null,null,null,null,null,null,15.5,null,null,"direct afgerekend of","direct afgerekend of","een soepje, 2 warme hapjes"," en drank gedurende 2 uur.",null,"hapjes, kleine versnaperingen","hapjes, kleine versnaperingen",null,null,"Martini","Martini","Assortiment van 4 aperitiefglaasjes (samenstelling kan verschillen), een soepje en 2 warme hapjes","Assortiment van 4 aperitiefglaasjes: (samenstelling kan verschillen)","kaasjes, salami, tapenades,","kaasjes, salami,  olijven, nootjes en chips.","kaasjes, salami,  olijven, nootjes en chips.","tapenades"]
[null,"Receptie B",null,null,null,null,null,null,12.600000000000001,null,null,"komt op 1 rekening","komt op 1 rekening","en drank gedurende 2 uur.",null,null,"en drank gedurende 2 uur.",null,null,null,"Kir","Kir","* eendenmousse met rode bessen en koornbloemblaadjes","* eendenmousse met rode bessen en koornbloemblaadjes"," olijven en nootjes en chips","lepeltje gevuld met vismousse","lepeltje gevuld met vismousse","nootjes en chips"]
[null,"Receptie A",null,null,null,null,null,null,10,null,null,null,null,null,null,null,null,null,null,null,"Frisdrank","Frisdrank","* luzerne met gerookte zalm, eitjes van vliegende vis in wasabi","* luzerne met gerookte zalm, eitjes van vliegende vis in wasabi",null,"lepeltje gevuld met vleesmousse","lepeltje gevuld met vleesmousse"]
[null,null,null,null,null,null,null,null,null,null,null,null,null,null,null,null,null,null,null,null,"Bieren","Bieren","* mousse van krab met rode bietscheutjes","* mousse van krab met rode bietscheutjes",null,"3 warme hapjes pp","3 warme hapjes pp"]
[null,null,null,null,null,null,null,null,null,null,null,null,null,null,null,null,null,null,null,null,"nootjes en chips inbegrepen","nootjes en chips inbegrepen","* preischeuten met garnalen en mini tomaat","* preischeuten met garnalen en mini tomaat",null,"* kippenbilletje * toastcupje * garnaal in filodeeg","* kippenbilletje * toastcupje * garnaal in filodeeg"]
[null,null,null,null,null,null,null,null,null,null,null,null,null,null,null,null,null,null,null,null,"TIP:","TIP:","* tomatensoepje en 2 warme hapjes, standaard een garnaal in filodeeg en een kippenvleugeltje",null,null,"3 koude toostjes pp"]
[null,"Schuimwijn van het huis (reeds inbegrepen)",null,null,null,null,null,null,0,null,null,null,null,null,null,null,null,null,null,null,"Een receptie naar believen","Receptie A is dezelfde prijs.","TIP: Er is veel meer keuze dan de standaard hapjes","TIP: Er is veel meer keuze dan de standaard hapjes",null,"* gerookte zalm * vissalade * grijze garnalen"]
[null,"Cava",null,null,null,null,null,null,3.25,null,null,null,null,null,null,null,null,null,null,null,"kost evenveel als","Maar daar is de drank naar believen gedurende ","die hierboven vermeld worden. Via deze tool kunt u dit","die hierboven vermeld worden. Via deze tool kunt u dit",null,"Tip: Bovenstaande hapjes kunnen ook gewijzigd worden.","Tip: Bovenstaande hapjes kunnen ook gewijzigd worden."]
[null,"Champagne",null,null,null,null,null,null,7,null,null,null,null,null,null,null,null,null,null,null,"2 aperitieven per persoon.","maximaal 2 uur. En er zijn wat tapenades.","niet aanpassen maar wel als u bij ons langskomt. ","niet aanpassen maar wel als u bij ons langskomt. ",null,"Niet via deze tool maar wel bij reservatie","Niet via deze tool maar wel bij reservatie"]
[null,null,null,null,null,null,null,null,null,null,null,null,null,null,null,null,null,null,null,null,"Selecteer daartoe receptie A!","We komen rond met schuimwijn en ","De keuzemogelijkheden staan gedetailleerd ","De keuzemogelijkheden staan gedetailleerd ",null,"De keuzemogelijkheden staan gedetailleerd ","De keuzemogelijkheden staan gedetailleerd "]
[null,null,null,null,null,null,null,null,null,null,null,null,null,null,null,null,null,null,null,null,0,"fruitsap maar alle bovenstaande dranken","beschreven in het pdf document \"prijslijst\" pagina 9.","beschreven in het pdf document \"prijslijst\" pagina 9.",null,"beschreven in het pdf document \"prijslijst\" pagina 9.","beschreven in het pdf document \"prijslijst\" pagina 9."]
[null,null,null,null,null,null,null,null,null,null,null,null,null,null,null,null,null,null,null,null,0,"kunnen op vraag ook bekomen worden.","U krijgt hier wel een prijsindicatie maar weet dat er meer moglijkheden zijn.","U krijgt hier wel een prijsindicatie maar weet dat er meer moglijkheden zijn.",null,"U krijgt hier wel een prijsindicatie maar weet dat er meer moglijkheden zijn.","U krijgt hier wel een prijsindicatie maar weet dat er meer moglijkheden zijn."]
[]
[null,"Dessertbuffet zonder maaltijd: ",null,null,null,null,null,null,16.5]
{"$rows_left_out":353}
{"sheet":"Algemene verkoopsvoorwaarden","index":2,"n_rows":63,"n_cols":13,"rows_kept":63,"cut":false,"hidden":false,"merged":[]}
[null,"Algemene verkoopsvoorwaarden:"]
[null,"1) Onze facturen zijn contant te betalen bij levering van de goederen. Bijgevolg zal in geval van laattijdige betaling"]
[null,"van rechtswege en zonder voorafgaande ingebrekestelling een intrest aangerekend worden van 12% per jaar op de "]
[null,"bedragen, verschuldigd acht dagen na de vervaldag van de facturen. Tevens zal bij gebrek aan betaling na "]
[null,"aanmaning bij gewone brief, het verschuldigde bedrag van rechtswege verhoogd worden met een forfaitaire"]
[null,"vergoeding van 12 % met een minimum van € 50  voor bijkomende administratieve kosten, debiteurenbewaking "]
[null,"en commerciële stoornissen. Wij behouden ons het recht voor op elk moment de leveringen te staken. Elke "]
[null,"klacht over de kwaliteit van de geleverde goederen moet uiterlijk 24 uur na de levering worden overgemaakt. "]
[null,"Klachten in verband met facturatie kunnen slechts in aanmerking worden genomen zo zij binnen de acht "]
[null,"dagen na ontvangst van de goederen bij aangetekende brief worden meegedeeld. In geval van betwisting zijn "]
[null,"uitsluitend de rechtbanken van Kortrijk bevoegd. De leveringen  geschieden op risico van de bestemmeling. Er "]
[null,"wordt uitdrukkelijk overeengekomen dat de klant door het plaatsen van een bestelling onze algemene "]
[null,"verkoopsvoorwaarden erkent. Elke wijziging hieraan moet voorafgaandelijk in een schriftelijk akkoord worden "]
[null,"vastgelegd."]
[]
[null,"2) Annulatie dient schriftelijk en gedateerd te geschieden. "]
[null,"In geval van annulatie minder dan 60 dagen voor de activiteit blijft het voorschot eigendom van het Katelijnenhof."]
[null,"Voor annulatie minder dan 10 dagen voor de activiteit is de klant in alle gevallen verplicht 35 % van de reservatie-"]
[null,"waarde van de gehele manifestatie te vergoeden."]
[null,"Bij annulatie minder dan 5 dagen voor  de activiteit is de klant in alle gevallen verplicht de reservatie waarde van de "]
[null,"gehele manifestatie te vergoeden."]
[]
[null,"3) Iedere levering van dranken, voedingswaren of diensten in de  zalen is uitsluitend voorbehouden aan het "]
[null,"Katelijnenhof, tenzij er een andere schriftelijke overeenkomst is."]
[]
[null,"4) De klant is eraan gehouden voor iedere dansavond met groot orkest een aanvraag tot toelating in te dienen bij "]
[null,"SABAM, Rijselsestraat 51, 8500 Kortrijk, Tel : 056/210738 en alle kosten voortvloeiend uit deze aanvraag te "]
[null,"dragen.  Voor een gewone disc-jockey betalen wij jaarlijks een vaste bijdrage. Het verbruik (drank en voeding) "]
[null,"van de DJ is ten laste van de klant. Gelet op de nieuwe geluidsnormen, van kracht op 01/01/2013, moet de "]
[null,"klant de DJ of elke andere persoon of toestel dat  geluid produceert verplichten zich aan deze normen te houden. "]
{"$rows_left_out":34}
{"sheet":"Reservatievoorstel","index":3,"n_rows":50,"n_cols":33,"rows_kept":50,"cut":false,"hidden":false,"merged":[[36,0,37,8],[40,0,42,8],[2,14,3,14],[2,15,3,15],[14,9,14,17],[16,9,16,17],[23,14,23,17],[25,9,26,17],[2,16,3,16],[2,17,3,17],[9,12,9,13],[12,9,12,11],[12,12,12,16],[38,0,39,8]]}
[null,null,"Reservatievoorstel",null,null,null,null,null,null,null,"Uitsplitsing per BTW tarief.",null,null,null,null,"Totaalprijs per vol:",{"$f":"D9","v":47.8}]
["Naam Klant:",null,{"$f":"'walking dinner'!F86","v":0},null,"Katelijnenhof",null,null,null,null,null,null,null,null,null,null,{"$f":"IF(Q2>0,\"Prijs drankforfait na de maaltijd, volledig aan 21% BTW:\",\"\")","v":""},{"$f":"'walking dinner'!D70","v":0}]
["Adres:",null,{"$f":"'walking dinner'!F87","v":0},null,"Heirweg 172",null,null,null,null,null,null,null,"Menu",null,"Dep. B",{"$f":"IF(Q2>0,\"Drank- forfait:\",\"\")","v":""},"Totaal aan 21%","Dep. A"]
["Stad:",null,{"$f":"'walking dinner'!F88","v":0},null,"8800 Roeselare",null,null,null,null,null,"aantal","totaal:","deel 12%","deel21%"]
["Tel nr:",null,{"$f":"'walking dinner'!F89","v":0},null,"info@katelijnenhof.be",null,null,"aankomst om:",{"$f":"'walking dinner'!F84","v":0},"Vol",{"$f":"C9","v":0},{"$f":"Q1-Q2","v":47.8},{"$f":"ROUND(L5*0.65,2)","v":31.07},{"$f":"L5-M5","v":16.729999999999997},{"$f":"K5*M5","v":0},{"$f":"Q2","v":0},{"$f":"N5+P5","v":16.729999999999997},{"$f":"K5*Q5","v":0}]
[{"$f":"'walking dinner'!J101","v":"reden feest:"},{"$f":"'walking dinner'!K101","v":0},null,null,"Gsm 0475/618058",null,null,"aan tafel om:",{"$f":"'walking dinner'!F85","v":0},"JR 1/2",{"$f":"C10","v":0},{"$f":"L5/2","v":23.9},{"$f":"ROUND(L6*0.65,2)","v":15.54},{"$f":"L6-M6","v":8.36},{"$f":"K6*M6","v":0},{"$f":"Q2/2","v":0},{"$f":"N6+P6","v":8.36},{"$f":"K6*Q6","v":0}]
["Datum activiteit:",null,{"$f":"'walking dinner'!F77","v":"00:00:00"},null,"Fax 051/747875",null,null,null,null,"JR 1/3",{"$f":"C11","v":0},{"$f":"L5/3","v":15.933333333333332},{"$f":"ROUND(L7*0.65,2)","v":10.36},5.5733333333333324,0,{"$f":"Q2/3","v":0},{"$f":"N7+P7","v":5.5733333333333324},0]
[null,null,"Totaal aantal personen:",{"$f":"C9+C12+C11+C10","v":0},"email klant:",null,{"$f":"'walking dinner'!F90","v":0},null,null,"JR gratis",{"$f":"C12","v":0},{"$f":"E12","v":0},{"$f":"ROUND(L8*0.65,2)","v":0},0,0,null,{"$f":"N8+P8","v":0},0]
[null,"volwassenen:",{"$f":"'walking dinner'!F79","v":0},{"$f":"'walking dinner'!D7","v":47.8},null,null,null,"raming totaal 1:",{"$f":"C9*D9+C10*D10+C11*D11+C12*D12","v":0},null,null,"Voorschot reeds betaald:",null,null,{"$f":"ROUND(M9/98*100,2)","v":0},{"$f":"IF(Q9>0,\"Huur zaal/muziekinstallatie: \",\"\")","v":""},{"$f":"I11","v":0}]
[null,"JR 1/2 (6 t.e.m. 11) :",{"$f":"'walking dinner'!F80","v":0},{"$f":"'walking dinner'!J7","v":23.9},null,null,null,"ander rekenblad:",{"$f":"'walking dinner'!F92","v":0},null,null,"Gestort / betaald op:"]
[null,"JR 1/3 (3 t.e.m. 5) :",{"$f":"'walking dinner'!F81","v":0},{"$f":"'walking dinner'!H7","v":15.933333333333332},null,null,null,"huur zaal:",{"$f":"IF(D8=0,0,IF((I9+I10)<'Algemene verkoopsvoorwaarden'!J44,('Algemene verkoopsvoorwaarden'!J44-Reservatievoorstel!I9-Reservatievoorstel!I10),0))","v":0},null,null,{"$f":"IF(O9>0,\"Voorschot uitgesplitst:\",\"\")","v":""},{"$f":"IF(O9>0,\" € \"&ROUND(O9*0.65,2) & \" x 12% => Dep. B  en € \" &ROUND(O9*0.35,2) & \" x 21% => Dep. A.\",\"\")","v":""}]
[null,"JR gratis (0 t.e.m. 2) :",{"$f":"'walking dinner'!F82","v":0},{"$f":"'walking dinner'!F7","v":"0,00"},null,null,null,"raming algemeen totaal:",{"$f":"I11+I10+I9","v":0},null,null,null,"Voorschot wordt gesplitst over:",{"$f":"IF(O9>0,ROUNDUP((O9+1)/L5,0),0)","v":0}," volwassenen"]
[null,null,null,null,null,null,null,"raming te betalen indien contante betaling  (max € 3000 cash):",{"$f":"'walking dinner'!G98","v":0},"Input GKS:",null,null,{"$f":"IF(O9*0.65 >N12*M5,\"ONMOGELIJK U bekomt negatieve waarden.\",\"\")","v":""}]
["Voorkeur tafelschikking:",null,null,{"$f":"'walking dinner'!K100","v":"geen voorkeur"},null,null,null,null,null,{"$f":"N12","v":0},"vol","x",{"$f":"IFERROR(ROUND(M5-O9*0.65/N12,2),\"\")","v":""},0.12,{"$f":"IFERROR(J14*M14,\"\")","v":""},"Dep. B","Verwerking voorschot"]
[{"$f":"'walking dinner'!H78","v":""},null,null,null,null,null,null,null,{"$f":"'walking dinner'!B22","v":"De gast die een extra aperitief bestelt betaalt deze zelf"},{"$f":"IFERROR( \" Er wordt € \" & ROUND(O9*0.65/N12,2) & \" minder geboekt bij \" & N12 & \" personen omdat dit reeds als voorschot werd geboekt.\",\"\")","v":""}]
[{"$f":"'walking dinner'!H79","v":""},null,null,null,null,null,null,null,{"$f":"IF(O9>0,\" Uw voorschot van € \" & O9 & \" wordt nog in mindering gebracht\",\"\")","v":""},{"$f":"N12","v":0},"vol","x",{"$f":"IFERROR(ROUND(Q5-O9*0.35/N12,2),\"\")","v":""},0.21,{"$f":"IFERROR(J16*M16,\"\")","v":""},"Dep. A","Verwerking voorschot"]
[{"$f":"'walking dinner'!H80","v":"Eerste buffet = 2 soorten soep"},null,null,null,null,null,null,null,null,{"$f":"IFERROR( \" Er wordt € \" & ROUND(O9*0.35/N12,2) & \" minder geboekt bij \" & N12 & \" personen omdat dit reeds als voorschot werd geboekt.\",\"\")","v":""}]
[{"$f":"'walking dinner'!H81","v":""},null,null,null,null,null,null,null,null,{"$f":"K5-J14","v":0},{"$f":"K14","v":"vol"},"x",{"$f":"M5","v":31.07},0.12,{"$f":"J18*M18","v":0},"Dep. B"]
[{"$f":"'walking dinner'!H82","v":""},null,null,null,null,null,null,null,null,{"$f":"K5-J16","v":0},{"$f":"K16","v":"vol"},"x",{"$f":"Q5","v":16.729999999999997},0.21,0,"Dep. A"]
[null,null,null,null,null,null,null,null,null,{"$f":"K6","v":0},{"$f":"J6","v":"JR 1/2"},"x",{"$f":"M6","v":15.54},0.12,0,"Dep. B"]
[{"$f":"'walking dinner'!H83","v":"Tweede buffet = broodjes, beleg en mini koud buffet."},null,null,null,null,null,null,null,null,{"$f":"K6","v":0},{"$f":"J6","v":"JR 1/2"},"x",{"$f":"Q6","v":8.36},0.21,0,"Dep. A"]
[{"$f":"IF('walking dinner'!B37=matrixen!$N$96,\"\",'walking dinner'!B37)","v":""},null,null,null,null,{"$f":"IF('walking dinner'!B43=matrixen!$N$96,\"\",'walking dinner'!B43)","v":""},null,null,null,{"$f":"K7","v":0},{"$f":"J7","v":"JR 1/3"},"x",{"$f":"M7","v":10.36},0.12,0,"Dep. B"]
[{"$f":"IF('walking dinner'!B38=matrixen!$N$96,\"\",'walking dinner'!B38)","v":""},null,null,null,null,{"$f":"IF('walking dinner'!B44=matrixen!$N$96,\"\",'walking dinner'!B44)","v":""},null,null,null,{"$f":"K7","v":0},{"$f":"J7","v":"JR 1/3"},"x",{"$f":"Q7","v":5.5733333333333324},0.21,0,"Dep. A",null,null,null,null,null,null,null,null,null,null,null,null,null,null,null,null,{"$f":"matrixen!B97","v":0}]
[{"$f":"IF('walking dinner'!B39=matrixen!$N$96,\"\",'walking dinner'!B39)","v":""},null,null,null,null,{"$f":"IF('walking dinner'!B45=matrixen!$N$96,\"\",'walking dinner'!B45)","v":""},null,null,null,{"$f":"IF(L24>0,\"1\",0)","v":0},{"$f":"IF(L24>0,\"x\",\"\")","v":""},{"$f":"Q9","v":0},{"$f":"IF(L24>0,\"21%\",\"\")","v":""},{"$f":"IF(L24>0,\"Dep. A\",\"\")","v":""},{"$f":"P9","v":""},null,null,null,null,null,null,null,null,null,null,null,null,null,null,null,null,null,{"$f":"matrixen!E97","v":0}]
[{"$f":"IF('walking dinner'!B40=matrixen!$N$96,\"\",'walking dinner'!B40)","v":""},null,null,null,null,{"$f":"IF('walking dinner'!B46=matrixen!$N$96,\"\",'walking dinner'!B46)","v":""},null,null,null,null,"Totale boekwaarde:",{"$f":"SUM(O14:O23)+L24+O9+I10","v":0},{"$f":"IF(SUM(O14:O23)+L24+O9+I10 <>I12,\" Er is iets fout met de splitsingstabel\",\"\")","v":""},null,null,null,null,null,null,null,null,null,null,null,null,null,null,null,null,null,null,null,{"$f":"matrixen!H97","v":0}]
[{"$f":"IF('walking dinner'!B41=matrixen!$N$96,\"\",'walking dinner'!B41)","v":""},null,null,null,null,{"$f":"IF('walking dinner'!B47=matrixen!$N$96,\"\",'walking dinner'!B47)","v":""},null,null,null,{"$f":"\"De eventuele korting contant van 2 %, in het huidig voorstel is dit € \" &ROUND( I12-I13,2) & \" is nog niet in bovenstaande splitsing verwerkt.\"","v":"De eventuele korting contant van 2 %, in het huidig voorstel is dit € 0 is nog niet in bovenstaande splitsing verwerkt."}]
[{"$f":"IF('walking dinner'!B42=matrixen!$N$96,\"\",'walking dinner'!B42)","v":""},null,null,null,null,{"$f":"IF('walking dinner'!B48=matrixen!$N$96,\"\",'walking dinner'!B48)","v":""}]
[]
[{"$f":"'walking dinner'!H91","v":"Koude aardappelen"},null,null,null,null,null,null,null,null,null,{"$f":"IF(K31<>\"\",\"Detail van het aperitief:\",\"\")","v":""}]
[]
{"$rows_left_out":20}